{"text_format":"1","workbook":"xlsx","n_sheets":14,"sheets":["Enlig","SÆS - enlig","Ægtefælle 1","Ægtefælle 2","SÆS - ægtepar","tabeller","Satsmapning","HTF-sats","2021 sats","2020 sats","2019 sats","2018-7 sats","2018-1 sats","2017 sats"],"not_rendered":{"charts":0,"images":0,"macros":1,"external_links":0,"defined_names":25,"comments":5,"pivot_tables":0},"unopened":[],"bounds":{"document_bytes":16777216,"sheet_cells":100000,"rows_first":2000,"rows_last":500,"rows_between":2000,"halvings":0,"cell_chars":16384,"cell_head_chars":4096},"cells_cut":0,"cells_raw":0,"read":"whole","date_system":"1900"}

{"sheet":"Enlig","index":0,"n_rows":64,"n_cols":18,"rows_kept":64,"cut":false,"hidden":false,"merged":[[61,14,61,17],[62,14,62,17],[58,14,58,17],[59,14,59,17],[60,14,60,17],[55,14,55,17],[56,14,56,17],[57,14,57,17],[52,14,52,17],[53,14,53,17],[54,14,54,17],[47,14,47,17],[48,14,48,17],[49,14,49,17],[50,14,50,17],[51,14,51,17],[42,14,42,17],[43,14,43,17],[44,14,44,17],[45,14,45,17],[46,14,46,17],[37,14,37,17],[38,14,38,17],[39,14,39,17],[40,14,40,17],[41,14,41,17],[32,14,32,17],[33,14,33,17],[34,14,34,17],[35,14,35,17],[36,14,36,17],[27,14,27,17],[28,13,28,18],[29,14,29,17],[30,14,30,17],[31,14,31,17],[1,1,1,5],[2,14,2,17],[4,15,5,15],[4,16,5,16],[4,17,5,17]]}
[]
[null,"Kontanthjælp, uddannelseshjælp og integrationsydelse/SHOY",null,null,null,null,null,"Mellemregninger"]
[null,null,null,null,null,null,null,"Fra - til / §",{"$f":"DATE(D4,I4,MAX(C5,1))","v":"2019-11-01"},{"$f":"DATE(D4,I4,MIN(D5,I5))","v":"2019-11-30"},{"$f":"IF(D4<2020,2,3)","v":2},null,null,null,"Input til KY"]
[null,"Måned /år","November",2019,null,null,null,"måned/år/kolonne",{"$f":"VLOOKUP(C4,Måneder,2,FALSE)","v":11},{"$f":"VLOOKUP(I4,måned_år,VLOOKUP(D4,Tabel14[],2,FALSE),FALSE)","v":2019},{"$f":"VLOOKUP(J4,Tabel26[[Kolonne1]:[kolonne]],2,FALSE)","v":12}]
[null,"Dag - fra-til",null,null,null,null,null,"måned/periode/-afbrydelse",{"$f":"VLOOKUP(C4,Tabel211[],D4-2012,FALSE)","v":30},{"$f":"J3-I3+1","v":30},{"$f":"J5-C6","v":30},null,null,null,null,"Resultat fra        KMD Aktiv","Resultat fra      Ny beregning","Indberetning til KY"]
[null,"Midlertidig afbrydelse",0,null,null,null,null,"Satsvalg",{"$f":"(I7&J14&J18&J17&J15&J16)+0","v":0},{"$f":"VLOOKUP(I6,Satsmap_1,2,FALSE)","v":0},{"$f":"VLOOKUP(J6,Satsmap,2,FALSE)","v":0}]
["Person",null,null,null,null,null,null,"Bevilling",{"$f":"VLOOKUP(C8,Bevilling,2,FALSE)","v":0},"Grundsats",{"$f":"VLOOKUP(K6,Alle_sats,K4,FALSE)","v":0}]
[null,"Bevilling","Vælg"," ",null,null,null,"Tillæg / reduktion dansktil",{"$f":"VLOOKUP(C9,Tillæg,2,FALSE)","v":0},{"$f":"IF(OR(I8=0,AND(I7=3,I8=1),AND(I7<3,I8=2)),0,VLOOKUP(J6,Satsmap,3,FALSE))","v":0},{"$f":"VLOOKUP(J8,Alle_sats,K4,FALSE)","v":0},{"$f":"MAX(IF(K8>0,IF(I7=3,MAX(K7+K8-K19-J10-L10,0),0),0),0)","v":0},null,null,"Bruttoydelse",null,{"$f":"F57","v":0},{"$f":"Q8-P8","v":0}]
[null,"Tillæg","Nej",null,null,null,null,"Fiktivt niveau",{"$f":"VLOOKUP(C10,Fiktivt_niveau,2,FALSE)","v":0},{"$f":"VLOOKUP(C10,Fiktivt_niveau,3,FALSE)","v":0},{"$f":"IF(I9>0,(I9&K14&K18&K17&K15&K16)+0,0)","v":0},{"$f":"VLOOKUP(K9,Satsmap_1,2,FALSE)","v":0},null,null,"ATP egen andel",null,{"$f":"F60","v":0},{"$f":"Q9-P9","v":0}]
[null," - Fiktivt niveau integrationsydelse","Vælg",null,null,null,null,"Fiktiv grund/akt.tllæg",{"$f":"VLOOKUP(L9,Satsmap,2,FALSE)","v":0},{"$f":"VLOOKUP(I10,Alle_sats,K4,FALSE)","v":0},{"$f":"IF(J9>0,VLOOKUP(L9,Satsmap,3,FALSE),0)","v":0},{"$f":"VLOOKUP(K10,Alle_sats,K4,FALSE)","v":0},null,null,"ATP kommuneandel",null,{"$f":"F61","v":0},{"$f":"Q10-P10","v":0}]
[null,null,null,null,null,null,null,"Samlet månedlig sats",{"$f":"K7+K8-L8+K21","v":0},null,null,null,null,null,"Periode fra",null,{"$f":"I3","v":"2019-11-01"},{"$f":"I3","v":"2019-11-01"}]
[null,"Alder","Vælg",null,null,null,null,null,null,null,null,null,null,null,"Periode til",null,{"$f":"J3","v":"2019-11-30"},{"$f":"J3","v":"2019-11-30"}]
[null,"Bosted person","Vælg",null,null,null,null,null,null,"justerede koder","Fiktive koder",null,null,null,"Tilbagebetaling sanktion",null,{"$f":"F58","v":" "},{"$f":"IF(Q13=\" \",\" \",Q13-P13)","v":" "}]
[null,"Gravid / psykisk lidelse","Nej",null,null,null,null,"Alder",{"$f":"VLOOKUP(C12,Tabel8[],2,FALSE)","v":0},{"$f":"IF(AND(I7=3,J18=2),3,IF(AND(I7=3,I14<3),2,IF(AND(I14<3,J18=2),2,IF(AND(I14<3,I16=1),2,IF(AND(I14<3,I16=2,I15=2),2,I14)))))","v":0},{"$f":"IF(AND(I14<3,J18=2),2,IF(J16=1,2,IF(AND(I16=2,I15=2),2,I14)))","v":0},null,null,null,"Tilbagebetalingsparagraf",null,{"$f":"IF(I42>0,K42,\" \")","v":" "},{"$f":"Q14","v":" "}]
[null,"Enlig/samlevende","Vælg",null,null,null,null,"bosted",{"$f":"IFERROR(VLOOKUP(C13,Tabel12[],2,FALSE),0)","v":0},{"$f":"IF(OR(I14=3,J16=1,J18=2),0,I15)","v":0},{"$f":"IF(OR(I14=3,I16=1,I18=2),0,I15)","v":0},null,null,null,"Tilbagebetalingspligt"]
["Børn",null,null,null,null,null,null,"unge opl.",{"$f":"VLOOKUP(C14,Ungekode,2,FALSE)","v":0},{"$f":"IF(OR(I14=3,I7=3),0,IF(AND(I16=1,J18=2,I17=1),0,IF(AND(I8=1,J18=2),0,I16)))","v":0},{"$f":"IF(I14=3,0,IF(AND(I16=1,J18=2,I17=1),0,I16))","v":0},null,null,null,"Tilbagebetalingsparagraf"]
[null,"Antal hjemmeboende",0,null,null,null,null,"Samliv",{"$f":"VLOOKUP(C15,Samliv,2,FALSE)","v":0},{"$f":"IF(J18=0,0,IF(AND(I7=1,I14=3),0,IF(AND(I7<3,I16=2),0,IF(I17>1,0,I17))))","v":0},{"$f":"IF(J18=0,0,IF(AND(J9=1,I14=3),0,J17))","v":0}]
[null,"Antal udeboende børn med bidrag",0,null,null,null,null,"Forsørger",{"$f":"IF(C17>0,2,IF(C18+C19>0,1,0))","v":0},{"$f":"IF(I18=2,2,IF(AND(I7=3,I18<2),0,IF(AND(I14=3,I18>0),2,IF(AND(I16=2,I18>0),2,0))))","v":0},{"$f":"IF(I18=2,2,IF(AND(I14=3,I18>0),2,IF(AND(I16=2,I18>0),2,0)))","v":0},null,null,null,"Kontanthjælpsloft",null,{"$f":"C64","v":" "},{"$f":"F64","v":0}]
[null,"Antal udeboende børn uden bidrag",0,null,null,null,null,"Fiktivt bidrag",{"$f":"IF(AND(J15>0,C18>0),1,0)","v":0},null,{"$f":"J20*C18*I19","v":0},null,null,null,"Hjælpsbeløb",null,null,{"$f":"F49-R20","v":0}]
["Indtægt",null,null,null,null,null,null,"bidrag",{"$f":"IF(I7=3,0,IF(AND(J15>0,C18>0),1,0))","v":0},{"$f":"VLOOKUP(12,Alle_sats,K4,FALSE)","v":1387},{"$f":"J20*C18*I20","v":0},null,null,null,"Dansktillæg/-bonus",null,null,{"$f":"IF(I7=3,K8-L8,0)","v":0}]
[null,"Arbejdsindtægt i måneden ",0,null,null,null,null,"nedsat bidrag",{"$f":"IF(I7=1,12,IF(I7=2,60,0))","v":0},{"$f":"VLOOKUP(1,Alle_sats,K4,FALSE)","v":15180},{"$f":"MAX(MIN(K20,J21-K8-K7),0)","v":0},null,null,null,"fradragsfri indtægt",null,null,{"$f":"E47","v":0}]
[null," - Arbejdstimer i måneden",0,null,null,null,null,null,null,null,null,null,null,null,"225-timers sanktion jf. § 13 g",null,null,{"$f":"E50","v":0}]
[null,"Arbejdsindtægt ukendt arbejdstid",0,null,null,null,null,"Timer i alt",{"$f":"ROUND(C22+C24,2)","v":0},null,null,null,null,null,"Øvrige sanktioner",null,null,{"$f":"E56-E50","v":0}]
[null," - Beregnet timetal",{"$f":"C23/J24","v":0},null,null,null,null,"Sats timefradrag",{"$f":"VLOOKUP(121,Alle_sats,K4,FALSE)","v":27.32},{"$f":"VLOOKUP(122,HTFsats,K4,FALSE)","v":241.73},null,null,null,null,"Særlig støtte"]
[null,"Anden bruttoydelse",0,null,null,null,null,null,null,null,null,null,null,null,"Særlig støtte ",null,null,{"$f":"'SÆS - enlig'!E71","v":0}]
[null,"Anden skattepligtig indtægt ",0,null,null,null,null,"225-timer",{"$f":"VLOOKUP(IF(I18>0,134,133),Alle_sats,K4,FALSE)","v":11423},{"$f":"IF(C29=\"ja\",IF((K7+K8+K21)>=I26,131,IF(OR(I7=1,I8=1,J6=\"23.2.3\"),132,0)),0)","v":0},{"$f":"VLOOKUP(J26,Alle_sats,K4,FALSE)","v":0},null,null,null,"Særlig støtte - terminshjælp",null,null,{"$f":"'SÆS - enlig'!E72","v":0}]
[null,"Ikke skattepligtig indtægt",0]
["Sanktioner",null,null,null,null,null,null,"Sanktioner"," fradragspct. ",{"$f":"IF(K4<13,ROUND(F49/MAX((E41+E42+E43),1),4),0)","v":0},{"$f":"IF(J28>0,J28,\" \")","v":" "}]
[null,"225-timers regel","Nej",null,null,null,null,"Periodesanktion","grundsats",{"$f":"VLOOKUP(J6,Satsmap,4,FALSE)","v":0},{"$f":"VLOOKUP(J29,Alle_sats,K4,FALSE)","v":0},null,null,"Noter"]
[null,"Periode sanktion (§§ 36-38) antal dage",0,null,null,null,null,null,"tillæg",{"$f":"IF(I8>0,VLOOKUP(J6,Satsmap,5,FALSE),0)","v":0},{"$f":"VLOOKUP(J30,Alle_sats,K4,FALSE)","v":0}]
[null,"Punktsanktion (§§ 39-40)","Nej"]
[null,"40a - dage uden hjælp",0,null,null,null,null,"Punktsanktion","grundsats",{"$f":"VLOOKUP(J6,Satsmap,6,FALSE)","v":0},{"$f":"VLOOKUP(J32,Alle_sats,K4,FALSE)","v":0}]
[null,"Sanktion uberettiget hjælp §§ 42-43","Vælg",null,null,null,null,null,"tillæg",{"$f":"IF(I8>0,VLOOKUP(J6,Satsmap,7,FALSE),0)","v":0},{"$f":"VLOOKUP(J33,Alle_sats,K4,FALSE)","v":0}]
[null,"§§ 42-43 antal dage",0]
[null,"Manuel sanktion",0,null,null,null,null,"Sanktion 2020",{"$f":"E41+E42+E43","v":0},{"$f":"IF(K4>11,IF(I35>I38,J38,IF(I35>I39,J39,IF(I35>I40,J40,J41))),0)","v":0},{"$f":"3*J35","v":0}]
["ATP"]
[null,"Antal måneder med hjælp",0]
[" ",null,null,null,null,null,null,null,{"$f":"VLOOKUP(301,HTFsats,K4,FALSE)","v":0},{"$f":"VLOOKUP(305,HTFsats,K4,FALSE)","v":0}]
[null,{"$f":"\"Beregning af \"&C8","v":"Beregning af Vælg"},null,{"$f":"I3","v":"2019-11-01"},{"$f":"J3","v":"2019-11-30"},{"$f":"K5&\" af \"&I5&\" dage\"","v":"30 af 30 dage"},null,null,{"$f":"VLOOKUP(302,HTFsats,K4,FALSE)","v":0},{"$f":"VLOOKUP(306,HTFsats,K4,FALSE)","v":0}]
[null,null,null," ",null,null,null,null,{"$f":"VLOOKUP(303,HTFsats,K4,FALSE)","v":0},{"$f":"VLOOKUP(307,HTFsats,K4,FALSE)","v":0}]
[null,{"$f":"C8","v":"Vælg"},{"$f":"VLOOKUP(K6,HTFsats,3,FALSE)","v":" - "},null,{"$f":"K7","v":0},null,null,null,0,{"$f":"VLOOKUP(308,HTFsats,K4,FALSE)","v":0}]
[null,{"$f":"IF(J8>0,C9,\"    - \")","v":"    - "},{"$f":"VLOOKUP(J8,HTFsats,3,FALSE)","v":" - "},null,{"$f":"K8","v":0},null,null,"1/3 sanktion",{"$f":"IF(C34>0,IF(I43>=J43,42,43),0)","v":0},{"$f":"VLOOKUP(C33,pgf42_43,2,FALSE)","v":0},{"$f":"\"§ \"&I42","v":"§ 0"}]
[null,{"$f":"IF(L8>0,\"   Reduktion dansktillæg\",\" \")","v":" "},null,{"$f":"IF(L13>0,-(J10+L10+K21),\" \")","v":" "},{"$f":"-L8","v":0},null,null,"Ydelse/grænsebeløb/periode ydelse/nedsættelse",{"$f":"K7+K8-L8","v":0},{"$f":"VLOOKUP(47,HTFsats,K4,FALSE)","v":11423},{"$f":"F45*C34/K5","v":0},{"$f":"IF(I42=42,K43/3,IF(AND(I42=43,J42=4),K35,0))","v":0}]
[null,{"$f":"IF(K21>0,\"Bidragstillæg\",\"     \")","v":"     "},{"$f":"IF(K21>0,VLOOKUP(I21,HTFsats,3,FALSE),\" \")","v":" "},{"$f":"IF(K31>0,K31,\" \")","v":" "},{"$f":"K21","v":0},null,null,"Tilbagebetaling (1+2/3/4+5)",{"$f":"IF(AND(J42<3,I42=43),K43/3,0)","v":0},{"$f":"IF(J42=3,K43-L43,0)","v":0},{"$f":"IF(J42>3,K43-L43,0)","v":0},{"$f":"MAX(I44,J44,K44)","v":0}]
[null,{"$f":"C8&\" inkl. tillæg\"","v":"Vælg inkl. tillæg"},null,{"$f":"K5&\" / \"&I5&\" af \"","v":"30 / 30 af "},{"$f":"SUM(E41:E44)","v":0},{"$f":"E45*K5/I5","v":0}]
[null,"   Indtægt i alt",null,null,{"$f":"C21+C23+C25+C26+C27","v":0},null,null,"ATP grænse forsørger/ ikke-forsørger",{"$f":"VLOOKUP(144,HTFsats,K4,FALSE)","v":15180},{"$f":"VLOOKUP(145,HTFsats,K4,FALSE)","v":11423},{"$f":"IF(I18>0,I46,J46)","v":11423}]
[null,"   Timefradrag",{"$f":"IF(I23>0,I23&\" timer á\", \" \")","v":" "},{"$f":"IF(I23>0,I24,\" \")","v":" "},{"$f":"-I23*I24","v":0},null,null,"ATP-sats egen / kommune",{"$f":"VLOOKUP(141,HTFsats,K4,FALSE)","v":95},{"$f":"VLOOKUP(142,HTFsats,K4,FALSE)","v":189}]
[null,"Indtægtsfradrag",null,null,{"$f":"SUM(E46:E47)","v":0},{"$f":"-MIN(MAX(E48,0),F45)","v":0},null,"OP-bidrag",{"$f":"VLOOKUP(143,HTFsats,K4,FALSE)","v":0}]
[null,{"$f":"\"Hjælpsbeløb \"&IF(AND(I7=3,K8>0),\"+ dansktillæg/-bonus\",\" \")","v":"Hjælpsbeløb  "},null,null,null,{"$f":"MAX(SUM(F45:F48),0)","v":0}]
[null,{"$f":"IF(K4>6,\"    Nedsættelse 225-timer\",\"  \")","v":"    Nedsættelse 225-timer"},{"$f":"IF(K26>0,VLOOKUP(J26,Alle_sats,3,FALSE),\" \")","v":" "},null,{"$f":"K26","v":0},null,null,"Kontanthjælpsloft"]
[null,"    Periodesanktioner §§ 36-38",{"$f":"IF(C30>0,IF(K4<13,(\"(\"&K29&\" + \"&K30&\") * \"&C30&\" * \"),J35&\" * \"&C30),\" \")","v":" "},{"$f":"IF(C30> 0,K28,\" \")","v":" "},{"$f":"IF(C30>0,IF(K4<13,ROUND((K29+K30)*C30*K28,2),C30*J35),0)","v":0},null,null,"Grænsebeløb stk.1",{"$f":"VLOOKUP(1,HTFsats,K4,FALSE)","v":15180},{"$f":"VLOOKUP(2,HTFsats,K4,FALSE)","v":11423},{"$f":"IF(OR(AND(F45>=I51,I18>0),AND(I11>=J51,I18=0)),1,0)","v":0}]
[null,"    Punktsanktion §§ 39-40",{"$f":"IF(K4<13,IF(C31=\"Ja\",\"(\"&K32&\" + \"&K33&\") * \",\" \"),\" \")","v":" "},{"$f":"IF(C31=\"Ja\",K28,\" \")","v":" "},{"$f":"IF(C31=\"Ja\",IF(K4<13,ROUND((K32+K33)*K28,2),K35),0)","v":0},null,null,"Stk. 2,3,4/valgt stk.",{"$f":"IF(AND(K51=0,I7=1),2,0)","v":0},{"$f":"IF(AND(K51=0,I7=2),3,0)","v":0},{"$f":"IF(AND(K51=0,I7=3),IF(K4>9,4,3),0)","v":0},{"$f":"IF(K4>6,MAX(K51,I52,J52,K52),0)","v":0}]
[null,"    § 40 a - udeblivelser",{"$f":"IF(C32>0,C32&\"/\"&I5&\" af \",\" \")","v":" "},{"$f":"IF(C32>0,F45,\" \")","v":" "},{"$f":"F45*C32/I5","v":0},null,null,"Samliv/ antal børn",{"$f":"VLOOKUP(C15,Samliv,3,FALSE)","v":0},{"$f":"IF(AND(C17+C18+C19>1,L52=1,I53=2),1,IF(C17+C18+C19>=2,2,C17+C18+C19))","v":0},{"$f":"IF(AND(L52>0,I53>0),L52&I53&J53,0)-0","v":0}]
[null,{"$f":"IF(I42>0,\"    Sanktion uberettiget hjælp § \"&I42,\"    Sanktion uberettiget hjælp §§ 42-43 \")","v":"    Sanktion uberettiget hjælp §§ 42-43 "},{"$f":"IF(I42=42,C34&\"/\"&K5&\" * 1/3 *\",\" \")","v":" "},{"$f":"IF(I42=42,F49,\" \")","v":" "},{"$f":"L43","v":0},null,null,"Loft sats",{"$f":"VLOOKUP(K53,Loftmap,2,FALSE)","v":0},{"$f":"VLOOKUP(I54,HTFsats,3,FALSE)","v":" - "}]
[null,"    Manuel sanktion",null,null,{"$f":"C35","v":0}]
[null,"Sanktioner i alt",null,null,{"$f":"SUM(E50:E55)","v":0},{"$f":"-MIN(E56,F49)","v":0}]
[null,"Bruttoydelse",null,null,null,{"$f":"SUM(F49:F56)","v":0}]
[null,{"$f":"IF(I42>0,\"Tilbagebetalingspligtig sanktion jf. § \"&I42,\" \")","v":" "},{"$f":"IF(L44>0,C34&\"/\"&K5&\" af\",\" \")","v":" "},{"$f":"IF(L44>0,F49-E54,\" \")","v":" "},null,{"$f":"IF(I42>0,MIN(L44,F57),\" \")","v":" "}]
[null,null,null,null,null,null,null,"Fejl",{"$f":"IF(AND(I7=2,I14=3),1,IF(AND(I7<3,I8=2),2,IF(AND(I7=3,I8=1),3,IF(AND(I7=3,I4<9,D4=2015),4,))))","v":0}]
[null,"ATP egen andel"," "," "," ",{"$f":"IF(AND(F57>=K46,C37>=12),I47*K5/I5,0)","v":0}]
[null,"ATP kommuneandel",null,null,null,{"$f":"IF(AND(F57>=K46,C37>=12),J47*K5/I5,0)","v":0}]
[null,"OP-bidrag",null,null,null,{"$f":"IF(I7<3,ROUND((F57-F60)*I48,0),0)","v":0}]
[null,null,null,null,null,null,null,null,{"$f":"TEXT(K26,\"%\")","v":"%"}]
[null,"Kontanthjælpsloft",{"$f":"IF(I54>0,VLOOKUP(I54,HTFsats,3,FALSE),\" \")","v":" "},null,null,{"$f":"VLOOKUP(I54,HTFsats,K4,FALSE)","v":0}]

{"sheet":"SÆS - enlig","index":1,"n_rows":72,"n_cols":10,"rows_kept":72,"cut":false,"hidden":false,"merged":[[1,1,1,4]]}
[]
[null,"Særlig støtte"]
[]
[null,"Måned /år",{"$f":"Enlig!C4","v":"November"},{"$f":"Enlig!D4","v":2019},null,null,null,null,{"$f":"Enlig!K4","v":12}]
[]
["Boligudgifter",null,"beløb","frekvens",null,null,null,"Boligudgifter pr. måned"]
[null,"Husleje",0,null,null,null,{"$f":"VLOOKUP(D7,Frekvens,2,FALSE)","v":1},{"$f":"C7/MAX(G7,1)","v":0}]
[null,"Boligstøtte",0,null,null,null,1,{"$f":"-C8/MAX(G8,1)","v":0}]
[null,"Varme",0,null,null,null,1,{"$f":"C9/MAX(G9,1)","v":0}]
[null,"El",0,null,null,null,1,0]
[null,"Gas",0,null,null,null,1,0]
[null,"Vand",0,null,null,null,1,0]
[null,"Ejendomsskat",0,null,null,null,1,0]
[null,"Ejendomsværdiskat",0,null,null,null,1,0]
[null,"Husforsikring",0,null,null,null,1,0]
[null,"Andre boligudgifter",0,null,null,null,1,0]
[null,"Indtægt fra lejer",0,null,null,null,1,{"$f":"-C17/MAX(G17,1)","v":0}]
[null,null,null,null,null,null,"I alt",{"$f":"SUM(H7:H17)","v":0}]
["Boliglån",null,"Ydelse","Rente + bidrag","Frekvens"]
[null,"Lån 1",0,0,null,null,{"$f":"VLOOKUP(E20,Frekvens,2,FALSE)","v":1},{"$f":"C20/MAX(G20,1)","v":0},{"$f":"D20/MAX(G20,1)","v":0}]
[null,"Lån 2",0,0,null,null,{"$f":"VLOOKUP(E21,Frekvens,2,FALSE)","v":1},{"$f":"C21/MAX(G21,1)","v":0},{"$f":"D21/MAX(G21,1)","v":0}]
[null,null,null,null,null,null,"lån i alt",{"$f":"SUM(H20:H21)","v":0},{"$f":"SUM(I20:I21)","v":0}]
["Udgifter til erhvervelse af indtægter",null,null,null,null,null,"I alt",{"$f":"H18+H22-I23","v":0},{"$f":"C31*(I22-MAX(C30-H35,0))","v":0}]
[null,"Transport",0]
[null,"Arbejdsredskaber m.v.",0,null,null,null,"H. børn",{"$f":"Enlig!C17","v":0},{"$f":"IF(H25>0,VLOOKUP(152,HTFsats,I4,FALSE),0)","v":0},{"$f":"MAX(VLOOKUP(154,HTFsats,I4,FALSE)*(H25-1),0)","v":0}]
[null,null,null,null,null,null,"U. børn",{"$f":"Enlig!C18+Enlig!C19","v":0},{"$f":"IF(AND(H25=0,H26>0),VLOOKUP(153,HTFsats,I4,FALSE),IF(AND(H26=0,H25=0),VLOOKUP(151,HTFsats,I4,FALSE),0))","v":3050},{"$f":"MAX(VLOOKUP(155,HTFsats,I4,FALSE)*IF(I26=0,H26,(H26-1)),0)","v":0}]
["Feriepenge",null,0,null,null,null,"Grænsebeløb",null,{"$f":"MAX((I25+I26)-(J25+J26),0)","v":3050}]
[]
["Skattekort",null,null,null,null,null,"ATP",{"$f":"IF(Enlig!F60>0,1,0)","v":0}]
[null,"Skattekort fradrag",0,"pr. måned",null,null,"Indtægter",{"$f":"Enlig!C21+Enlig!C23+Enlig!C25+Enlig!C26","v":0}]
[null,"Trækprocent",0,null,null,null,"Bruttoydelse",{"$f":"Enlig!F49","v":0}]
[null,null,null,null,null,null,"ATP",{"$f":"IF(OR(AND(H25>0,H31>=H49,H29=1),AND(H25=0,H31>=I49,H29=1)),-J49,0)","v":0}]
["Loft for særlig støtte",null,null,null,null,null,"Bruttoindtægt",{"$f":"SUM(H30:H32)","v":0}]
[null,"Hidtidig nettoindtægt",0,null,null,null,"Beregnet skat",{"$f":"ROUND((H33-C30)*C31,0)","v":0}]
[null,"Antal måneder med hjælp",0,null,null,null,"Bruttoydelse",{"$f":"Enlig!I11","v":0}]
[null,null,null,null,null,null,"ATP",{"$f":"IF(OR(AND(H25>0,H35>=H49,H29=1),AND(H25=0,H35>=I49,H29=1)),-J49,0)","v":0}]
[null,null,null,null,null,null,"Beregnet skat",{"$f":"ROUND((H35+H36-C30)*C31,0)","v":0}]
[]
[null,null,null,null,null,null,"90% Hidtidig nettoindtægt",{"$f":"C34*0.9","v":0},null,{"$f":"H39","v":0}]
[null,null,null,null,null,null,"Loft ikke-forsørger - evt. ATP",{"$f":"I50","v":15085},{"$f":"H40-(ROUND((H40-C30)*C31,0))","v":15085},{"$f":"IF(AND(H25+H26=0,J41=0),I40,0)","v":15085}]
[null,null,null,null,null,null,"Loft integrationsydelse",{"$f":"VLOOKUP(157,HTFsats,I4,FALSE)","v":13498},{"$f":"H41-(ROUND((H41-C30)*C31,0))","v":13498},{"$f":"IF(Enlig!I7=3,I41,0)","v":0}]
[null,"Beregning særlig støtte § 34",null,null,null,null,"Dagpengeloft - ATP",{"$f":"H46-H47","v":18677},{"$f":"H42-(ROUND((H42-C30)*C31,0))","v":18677},{"$f":"IF(C35>3,I42,0)","v":0}]
[]
[null,"  Boligudgift",{"$f":"H23","v":0},null,null,null,{"$f":"IF(J44=J39,G39,IF(J44=J40,G40,G41))","v":"Loft ikke-forsørger - evt. ATP"},null,null,{"$f":"MAX(J39,J40,J41)","v":15085}]
[null,"  Grænsebeløb",{"$f":"-I27","v":-3050}]
[null,"Beregnet støtte 1",null,null,{"$f":"MAX(SUM(C44:C45),0)","v":0},null,"Dagpenge max",{"$f":"VLOOKUP(156,HTFsats,I4,FALSE)","v":18866}]
[null,null,null,null,null,null,"ATP af dagpenge",{"$f":"VLOOKUP(158,HTFsats,I4,FALSE)","v":189}]
[null,"  Bruttoydelse",{"$f":"H31","v":0}]
[null,"  Beregnet ATP",{"$f":"H32","v":0},null,null,null,"ATP  forsørger/ej fors/sats",{"$f":"VLOOKUP(144,HTFsats,I4,FALSE)","v":15180},{"$f":"VLOOKUP(145,HTFsats,I4,FALSE)","v":11423},{"$f":"VLOOKUP(141,HTFsats,I4,FALSE)","v":95}]
[null,"  Bruttoindtægt",{"$f":"H30","v":0},null,null,null,"Loft ej-forsørger m/u ATP",{"$f":"VLOOKUP(1,HTFsats,I4,FALSE)","v":15180},{"$f":"IF(C35>=0,H50-J49,H50)","v":15085}]
[null,"  Beregnet skat",{"$f":"-H34","v":0}]
[null,"  Ikke-skattepligtig indtægt",{"$f":"Enlig!C27","v":0}]
[null,"  Feriepenge",{"$f":"C27","v":0}]
[null,"  Transport m.m.",{"$f":"-(C24+C25)","v":0}]
[null,"Nettoindtægt",null,{"$f":"SUM(C48:C54)","v":0}]
[null,"  Fastsat bruttoydelse",{"$f":"H35","v":0}]
[null,"  Beregnet ATP",{"$f":"H36","v":0}]
[null,"  Beregnet skat",{"$f":"-H37","v":0}]
[null,"Nettokontanthjælpsniveau",null,{"$f":"SUM(C56:C58)","v":0}]
[null,"Indtægtsoverskud",null,{"$f":"MAX(D55-D59,0)","v":0},{"$f":"-MIN(E46,D60)","v":0}]
[null,"Beregnet støtte jf. § 5",null,null,{"$f":"MAX(SUM(E46:E60),0)","v":0}]
[]
[null,"Samlet nettoindtægt",null,{"$f":"D55+E61","v":0}]
[null,{"$f":"G44","v":"Loft ikke-forsørger - evt. ATP"},null,{"$f":"J44","v":15085}]
[null,"Nedsættelse jf. § 6",null,{"$f":"MAX(D63-D64,0)","v":0},{"$f":"-MIN(D65,E61)","v":0}]
[null,"Beregnet støtte jf. § 6",null,null,{"$f":"SUM(E61:E65)","v":0}]
[null,"   Dagpengeloft",null,{"$f":"J42","v":0}]
[null,"Nedsættelse jf. § 7",null,{"$f":"IF(D67>0,MAX((D63-D65)-D67,0),0)","v":0},{"$f":"-MIN(D68,E66)","v":0}]
[null,"Beregnet særlig støtte",null,null,{"$f":"E66+E68","v":0}]
[]
[null,"Ikke tilbagebetalingspligtig hjælp",null,null,{"$f":"E69-E72","v":0}]
[null,"Tilbagebetalingspligtig jf. § 92, stk. 1",null,null,{"$f":"MIN(H22-I23,E69)","v":0}]

{"sheet":"Ægtefælle 1","index":2,"n_rows":66,"n_cols":18,"rows_kept":66,"cut":false,"hidden":false,"merged":[[32,14,32,17],[1,1,1,5],[2,14,2,17],[4,15,5,15],[4,16,5,16],[4,17,5,17],[26,14,26,17],[27,13,27,18],[28,14,28,17],[29,14,29,17],[30,14,30,17],[31,14,31,17],[55,14,55,17],[44,14,44,17],[41,14,41,17],[42,14,42,17],[33,14,33,17],[34,14,34,17],[35,14,35,17],[36,14,36,17],[37,14,37,17],[43,14,43,17],[38,14,38,17],[39,14,39,17],[40,14,40,17],[38,1,38,2],[66,14,66,17],[61,14,61,17],[62,14,62,17],[65,14,65,17],[60,14,60,17],[45,14,45,17],[46,14,46,17],[47,14,47,17],[48,14,48,17],[49,14,49,17],[50,14,50,17],[51,14,51,17],[52,14,52,17],[53,14,53,17],[54,14,54,17]]}
[]
[null,"Kontanthjælp, uddannelseshjælp og integrationsydelse/SHOY",null,null,null,null,null,"Mellemregninger"]
[null,null,null,null,null,null,null,"Fra - til / §",{"$f":"DATE(D4,I4,MAX(C5,1))","v":"2019-11-01"},{"$f":"DATE(D4,I4,MIN(D5,I5))","v":"2019-11-30"},{"$f":"IF(D4<2020,2,3)","v":2},null,null,null,"Input til KY"]
[null,"Måned /år","November",2019,null,null,null,"måned/år/kolonne",{"$f":"VLOOKUP(C4,Måneder,2,FALSE)","v":11},{"$f":"VLOOKUP(I4,måned_år,VLOOKUP(D4,Tabel14[],2,FALSE),FALSE)","v":2019},{"$f":"VLOOKUP(J4,Tabel26[[Kolonne1]:[kolonne]],2,FALSE)","v":12}]
[null,"Dag - fra-til",null,null,null,null,null,"måned/periode/-afbrydelse",{"$f":"VLOOKUP(C4,Tabel211[],D4-2012,FALSE)","v":30},{"$f":"J3-I3+1","v":30},{"$f":"J5-C6","v":30},null,null,null,null,"Resultat fra        KMD Aktiv","Resultat fra      Ny beregning","Indberetning til KY"]
[null,"Midlertidig afbrydelse",0,null,null,null,null,"Satsvalg",{"$f":"(I7&J14&J18&J17&J15&J16)+0","v":0},{"$f":"VLOOKUP(I6,Satsmap_1,2,FALSE)","v":0},{"$f":"VLOOKUP(J6,Satsmap,2,FALSE)","v":0}]
["Person",null,null,null,null,null,null,"Bevilling",{"$f":"VLOOKUP(C8,Bevilling,2,FALSE)","v":0},"Grundsats",{"$f":"VLOOKUP(K6,Alle_sats,K4,FALSE)","v":0}]
[null,"Bevilling","Vælg"," ",null,null,null,"Tillæg / reduktion dansktil",{"$f":"VLOOKUP(C9,Tillæg,2,FALSE)","v":0},{"$f":"IF(OR(I8=0,AND(I7=3,I8=1),AND(I7<3,I8=2)),0,VLOOKUP(J6,Satsmap,3,FALSE))","v":0},{"$f":"VLOOKUP(J8,Alle_sats,K4,FALSE)","v":0},null,null,null,"Bruttoydelse",null,{"$f":"F59","v":0},{"$f":"Q8-P8","v":0}]
[null,"Tillæg","Nej",null,null,null,null,"Ydelse i alt",null,{"$f":"K7+K8+L8","v":0},{"$f":"K7+K8+K21","v":0},null,null,null,"ATP egen andel",null,{"$f":"F62","v":0},{"$f":"Q9-P9","v":0}]
[null," - Fiktivt niveau integrationsydelse","Vælg",null,null,null,null,"Fiktivt niveau",{"$f":"IF(AND(I12=0,I7<3),0,IF(I12=3,3,VLOOKUP(C10,Fiktivt_niveau,2,FALSE)))","v":0},{"$f":"IF(I7=3,VLOOKUP(C10,Fiktivt_niveau,3,FALSE),IF(I10=3,'Ægtefælle 2'!I8,0))","v":0},{"$f":"IF(I10>0,(I10&K14&K18&K17&K15&K16)+0,0)","v":0},{"$f":"VLOOKUP(K10,Satsmap_1,2,FALSE)","v":0},null,null,"ATP kommuneandel",null,{"$f":"F63","v":0},{"$f":"Q10-P10","v":0}]
[null,null,null,null,null,null,null,"Fiktiv grund/akt.tllæg",{"$f":"VLOOKUP(L10,Satsmap,2,FALSE)","v":0},{"$f":"VLOOKUP(I11,Alle_sats,K4,FALSE)","v":0},{"$f":"IF(J10>0,VLOOKUP(L10,Satsmap,3,FALSE),0)","v":0},{"$f":"VLOOKUP(K11,Alle_sats,K4,FALSE)","v":0},null,null,"Periode fra",null,{"$f":"I3","v":"2019-11-01"},{"$f":"I3","v":"2019-11-01"}]
[null,"Alder","Vælg",null,null,null,null,"Ægtefælle/dansktillæg reduktion",{"$f":"IF(AND(I7<3,'Ægtefælle 2'!I7=3,I17>1),3,0)","v":0},{"$f":"J11+L11","v":0},{"$f":"IF(I12=3,K9-'Ægtefælle 2'!K9,0)","v":0},{"$f":"IF(K9>J12,IF(I10=0,0,K9-MAX(J12,K12)),0)","v":0},null,null,"Periode til",null,{"$f":"J3","v":"2019-11-30"},{"$f":"J3","v":"2019-11-30"}]
[null,"Bosted person","Vælg",null,null,null,null,"Ægtefællereduktion korrigeret for indtægt",{"$f":"K9-L12-E47-E48","v":0},{"$f":"'Ægtefælle 2'!I13","v":0},{"$f":"IF(OR(I13<0,J13<0),0,IF(I12=3,1,0))","v":0},{"$f":"IF(I7=3,K7,IF(I10=3,MIN(K9,J11),0))","v":0},null,null,"Tilbagebetaling sanktion",null,{"$f":"F60","v":" "},{"$f":"IF(Q13=\" \",\" \",Q13-P13)","v":" "}]
[null,"Gravid / psykisk lidelse","Nej",null,null,null,null,"Alder",{"$f":"VLOOKUP(C12,Tabel8[],2,FALSE)","v":0},{"$f":"IF(AND(I7=3,J18=2),3,IF(AND(I7=3,I14<3),2,IF(AND(I14<3,J18=2),2,IF(AND(I14<3,I16=1),2,IF(AND(I14<3,I16=2,I15=2),2,I14)))))","v":0},{"$f":"IF(AND(I10=3,K18=2),3,IF(AND(I10=3,I14<3),2,IF(AND(I14<3,K18=2),2,IF(AND(I14<3,I16=1),2,IF(AND(I14<3,I16=2,I15=2),2,I14)))))","v":0},null,null,null,"Tilbagebetalingsparagraf",null,{"$f":"IF(I42>0,K42,\" \")","v":" "},{"$f":"Q14","v":" "}]
[null,"Enlig/samlevende/gift","Vælg",null,null,null,null,"bosted",{"$f":"IFERROR(VLOOKUP(C13,Tabel12[],2,FALSE),0)","v":0},{"$f":"IF(OR(I14=3,J16=1,J18=2),0,I15)","v":0},{"$f":"IF(OR(I14=3,K16=1,K18=2),0,I15)","v":0},null,null,null,"Tilbagebetalingspligt"]
["Børn",null,null,null,null,null,null,"unge opl.",{"$f":"VLOOKUP(C14,Ungekode,2,FALSE)","v":0},{"$f":"IF(OR(I14=3,I7=3),0,IF(AND(I16=1,J18=2,I17=1),0,IF(AND(I8=1,J18=2),0,I16)))","v":0},{"$f":"IF(OR(I14=3,I10=3),0,IF(AND(I16=1,K18=2,I17=1),0,I16))","v":0},null,null,null,"Tilbagebetalingsparagraf"]
[null,"Antal hjemmeboende",0,null,null,null,null,"Samliv",{"$f":"VLOOKUP(C15,Samliv,2,FALSE)","v":0},{"$f":"IF(J18=0,0,IF(AND(I7=1,I14=3),0,IF(AND(I7<3,I16=2),0,IF(I17>1,0,I17))))","v":0},{"$f":"IF(K18=0,0,IF(AND(I10=1,I14=3),0,IF(AND(I10<3,I16=2),0,IF(I17>1,0,I17))))","v":0}]
[null,"Antal udeboende børn med bidrag",0,null,null,null,null,"Forsørger",{"$f":"IF(C17>0,2,IF(C18+C19>0,1,0))","v":0},{"$f":"IF(I18=2,2,IF(AND(I7=3,I18<2),0,IF(AND(I14=3,I18>0),2,IF(AND(I16=2,I18>0),2,0))))","v":0},{"$f":"IF(I18=2,2,IF(AND(I10=3,I18<2),0,IF(AND(I14=3,I18>0),2,IF(AND(I16=2,I18>0),2,0))))","v":0},null,null,null,"Kontanthjælploft",null,{"$f":"C66","v":" "},{"$f":"F66","v":0}]
[null,"Antal udeboende børn uden bidrag",0,null,null,null,null,"Fiktivt bidrag",{"$f":"IF(AND(J15>0,C18>0),1,0)","v":0},null,{"$f":"J20*C18*I19","v":0},null,null,null,"Hjælpsbeløb",null,null,{"$f":"F51","v":0}]
["Indtægt",null,null,null,null,null,null,"bidrag",{"$f":"IF(I7=3,0,IF(AND(J15>0,C18>0),1,0))","v":0},{"$f":"VLOOKUP(12,Alle_sats,K4,FALSE)","v":1387},{"$f":"J20*C18*I20","v":0},null,null,null,"fradragsfri indtægt",null,null,{"$f":"E48","v":0}]
[null,"Arbejdsindtægt i måneden ",0,null,null,null,null,"nedsat bidrag",{"$f":"IF(I7=1,12,IF(I7=2,60,0))","v":0},{"$f":"VLOOKUP(1,Alle_sats,K4,FALSE)","v":15180},{"$f":"MAX(MIN(K20,J21-K8-K7),0)","v":0},null,null,null,"225-timers sanktion",null,null,{"$f":"E52","v":0}]
[null," - Arbejdstimer i måneden",0,null,null,null,null,null,null,null,null," ",null,null,"Øvrige sanktioner",null,null,{"$f":"E58-E52","v":0}]
[null,"Arbejdsindtægt ukendt arbejdstid",0,null,null,null,null,"Timer i alt/sats timefradrag",{"$f":"ROUND(C22+C24,2)","v":0},{"$f":"VLOOKUP(121,Alle_sats,K4,FALSE)","v":27.32},{"$f":"VLOOKUP(122,HTFsats,K4,FALSE)","v":241.73},null,null,null,"Særlig støtte"]
[null," - Beregnet timetal",{"$f":"C23/K23","v":0},null,null,null,null,"indtægtsoverskud",{"$f":"MAX(E47+E48-F46,0)","v":0},null,null,null,null,null,"Særlig støtte ",null,null,{"$f":"'SÆS - ægtepar'!C79","v":0}]
[null,"Anden bruttoydelse",0,null,null,null,null,null,null,null,null,null,null,null,"Særlig støtte - terminshjælp",null,null,{"$f":"'SÆS - ægtepar'!C80","v":0}]
[null,"Anden skattepligtig indtægt",0,null,null,null,null,"225-timer - enlig",{"$f":"VLOOKUP(IF(I18>0,134,133),Alle_sats,K4,FALSE)","v":11423},{"$f":"IF(AND(I27=1,NOT(I10=3)),IF(L26=1,131,IF(OR(I7=1,I8=1,J6=\"23.2.3\"),132,0)),0)","v":0},{"$f":"VLOOKUP(J26,Alle_sats,K4,FALSE)","v":0},{"$f":"IF(AND(K7+K8>=I26),1,0)","v":0}]
[null,"Ikke skattepligtig indtægt",0,null,null,null,null,"Nedsættelse",{"$f":"IF(K4>6,VLOOKUP(C29,timeregel,2,FALSE),0)","v":0},{"$f":"IF(AND(I27=2,I17=3,'Ægtefælle 2'!I27=0),IF(OR(I7=3,I10=3),8,IF(AND(L26=1,'Ægtefælle 2'!L26=1),5,7)),0)","v":0}]
["Sanktioner",null,null,null,null,null,null,"Beregnet nedættelse 5/7/8",{"$f":"IF(J27=5,K9,0)","v":0},{"$f":"MAX(IF(J27=7,J9+'Ægtefælle 2'!J9-'Ægtefælle 2'!I26,0),0)","v":0},{"$f":"IF(L13+'Ægtefælle 2'!L13>='Ægtefælle 2'!I26,MAX(L13-('Ægtefælle 2'!I26-'Ægtefælle 2'!L13),0),0)","v":0},{"$f":"IF(K26>0,K26,IF(J27=5,I28,IF(J27=7,J28,IF(J27=8,K28,0))))","v":0},null,"Noter"]
[null,"225-timers regel","Nej"]
[null,"Periode sanktion (§§ 36-38) antal dage",0,null,null,null,null,"Sanktioner"," fradragspct. ",{"$f":"IF(K4<13,ROUND(F51/MAX(E41+E42+E43,1),4),0)","v":0},{"$f":"IF(J30>0,J30,\" \")","v":" "}]
[null,"Punktsanktion (§§ 39-40)","Nej",null,null,null,null,"Periodesanktion","grundsats",{"$f":"VLOOKUP(J6,Satsmap,4,FALSE)","v":0},{"$f":"VLOOKUP(J31,Alle_sats,K4,FALSE)","v":0}]
[null,"40a - dage uden hjælp",0,null,null,null,null,null,"tillæg",{"$f":"IF(I8>0,VLOOKUP(J6,Satsmap,5,FALSE),0)","v":0},{"$f":"VLOOKUP(J32,Alle_sats,K4,FALSE)","v":0}]
[null,"Sanktion uberettiget hjælp §§ 42-43","Vælg"]
[null,"§§ 42-43 antal dage",0,null,null,null,null,"Punktsanktion","grundsats",{"$f":"VLOOKUP(J6,Satsmap,6,FALSE)","v":0},{"$f":"VLOOKUP(J34,Alle_sats,K4,FALSE)","v":0}]
[null,"Manuel sanktion",0,null,null,null,null,null,"tillæg",{"$f":"IF(I8>0,VLOOKUP(J6,Satsmap,7,FALSE),0)","v":0},{"$f":"VLOOKUP(J35,Alle_sats,K4,FALSE)","v":0}]
["ATP"]
[null,"Antal måneder med hjælp",0,null,null,null,null,"Sanktion 2020",{"$f":"E41+E42+E43","v":0},{"$f":"IF(K4>11,IF(I37>I38,J38,IF(I37>I39,J39,IF(I37>I40,J40,J41))),0)","v":0},{"$f":"3*J37","v":0}]
[" ",null,null,null,null,null,null,null,{"$f":"VLOOKUP(301,HTFsats,K4,FALSE)","v":0},{"$f":"VLOOKUP(305,HTFsats,K4,FALSE)","v":0}]
[null,{"$f":"\"Beregning af \"&C8","v":"Beregning af Vælg"},null,{"$f":"I3","v":"2019-11-01"},{"$f":"J3","v":"2019-11-30"},{"$f":"K5&\" af \"&I5&\" dage\"","v":"30 af 30 dage"},null,null,{"$f":"VLOOKUP(302,HTFsats,K4,FALSE)","v":0},{"$f":"VLOOKUP(306,HTFsats,K4,FALSE)","v":0}]
[null,null,null," ",null,null,null,null,{"$f":"VLOOKUP(303,HTFsats,K4,FALSE)","v":0},{"$f":"VLOOKUP(307,HTFsats,K4,FALSE)","v":0}]
[null,{"$f":"C8","v":"Vælg"},{"$f":"VLOOKUP(K6,HTFsats,3,FALSE)","v":" - "},null,{"$f":"K7","v":0},null,null,null,0,{"$f":"VLOOKUP(308,HTFsats,K4,FALSE)","v":0}]
[null,{"$f":"IF(J8>0,C9,\"    - \")","v":"    - "},{"$f":"VLOOKUP(J8,HTFsats,3,FALSE)","v":" - "},null,{"$f":"K8","v":0},null,null,"1/3 sanktion",{"$f":"IF(C34>0,IF(I43>=J43,42,43),0)","v":0},{"$f":"VLOOKUP(C33,pgf42_43,2,FALSE)","v":0},{"$f":"\"§ \"&I42","v":"§ 0"}]
[null,{"$f":"IF(I12=3,\"   Ægtefællereduktion jf. § 26, stk.2\",IF(L8>0,\"   Reduktion dansktillæg\",\" \"))","v":" "},null,null,{"$f":"IF(AND(I10>0,K13=1),-L12,0)","v":0},null,null,"Ydelse/grænsebeløb/periode ydelse/nedsættelse",{"$f":"K7+K8-L8","v":0},{"$f":"VLOOKUP(47,HTFsats,K4,FALSE)","v":11423},{"$f":"F46*C34/K5","v":0},{"$f":"IF(I42=42,K43/3,IF(AND(I42=43,J42=4),K37,0))","v":0}]
[null,{"$f":"IF(K21>0,\"Bidragstillæg\",\"     \")","v":"     "},{"$f":"IF(K21>0,VLOOKUP(I21,HTFsats,3,FALSE),\" \")","v":" "},{"$f":"IF(K33>0,K33,\" \")","v":" "},{"$f":"K21","v":0},null,null,"Tilbagebetaling (1+2/3/4+5)",{"$f":"IF(AND(J42<3,I42=43),K43/3,0)","v":0},{"$f":"IF(J42=3,K43-L43,0)","v":0},{"$f":"IF(J42>3,K43-L43,0)","v":0},{"$f":"MAX(I44,J44,K44)","v":0}]
[null,{"$f":"IF(I27=2,\"Nedsættelse 225-timer\",\" \")","v":" "},{"$f":"IF(AND(I27=2,J27>0),\"§ 26, stk. \"&J27,\" \")","v":" "},null,{"$f":"IF(I27=2,-L28,0)","v":0}]
[null,{"$f":"C8&\" inkl. tillæg\"","v":"Vælg inkl. tillæg"},null,{"$f":"K5&\" / \"&I5&\" af \"","v":"30 / 30 af "},{"$f":"SUM(E41:E45)","v":0},{"$f":"E46*K5/I5","v":0},null,"ATP grænse forsørger/ ikke-forsørger",{"$f":"VLOOKUP(144,HTFsats,K4,FALSE)","v":15180},{"$f":"VLOOKUP(145,HTFsats,K4,FALSE)","v":11423},{"$f":"IF(I18>0,I46,J46)","v":11423}]
[null,"   Indtægt i alt",null,null,{"$f":"C21+C23+C25+C26+C27","v":0},null,null,"ATP-sats egen / kommune",{"$f":"VLOOKUP(141,HTFsats,K4,FALSE)","v":95},{"$f":"VLOOKUP(142,HTFsats,K4,FALSE)","v":189}]
[null,"   Timefradrag",{"$f":"IF(I23>0,I23&\" timer á\", \" \")","v":" "},{"$f":"IF(I23>0,J23,\" \")","v":" "},{"$f":"-I23*J23","v":0},null,null,"OP-bidrag",{"$f":"VLOOKUP(143,HTFsats,K4,FALSE)","v":0}]
[null,"   Indtægt overført fra ægtefælle",null,null,{"$f":"IF(I17=3,'Ægtefælle 2'!I24,0)","v":0}]
[null,"Indtægtsfradrag",null,null,{"$f":"SUM(E47:E49)","v":0},{"$f":"-MIN(MAX(E50,0),F46)","v":0},null,"Kontanthjælpsloft"]
[null,{"$f":"\"Hjælpsbeløb\"&IF(OR(I8=2,J11=2),\" + dansktillæg\",\" \")","v":"Hjælpsbeløb "},null,null,null,{"$f":"MAX(SUM(F46:F50),0)","v":0},null,"Grænsebeløb stk.1/stk.5",{"$f":"VLOOKUP(1,HTFsats,K4,FALSE)","v":15180},{"$f":"VLOOKUP(2,HTFsats,K4,FALSE)","v":11423},{"$f":"IF(OR(AND(F46>=I51,I18>0),AND(F46>=J51,I18=0)),1,0)","v":0},{"$f":"IF('Ægtefælle 2'!J27=8,IF(K4<10,5,7),IF(J27=8,IF(K4<10,6,8),0))","v":0}]
[null,{"$f":"IF(K4>6,\"    Nedsættelse 225-timer, enlig\",\"  \")","v":"    Nedsættelse 225-timer, enlig"},{"$f":"IF(K26>0,VLOOKUP(J26,Alle_sats,3,FALSE),\" \")","v":" "},null,{"$f":"IF(I27=1,K26,0)","v":0},null,null,"Stk. 2,3,4/valgt stk.",{"$f":"IF(AND(K51=0,I7=1,I10=0),2,0)","v":0},{"$f":"IF(AND(K51=0,I7=2,I10=0),3,0)","v":0},{"$f":"IF(AND(K51=0,OR(I7=3,I10=3)),IF(K4>9,4,3),0)","v":0},{"$f":"IF(K4>6,MAX(K51,I52,J52,K52,L51),0)","v":0}]
[null,"    Periodesanktioner §§ 36-38",{"$f":"IF(AND(C30>0,F51>0),IF(K4<13,(\"(\"&K31&\" + \"&K32&\") * \"&C30&\" * \"),J37&\" * \"&C30),\" \")","v":" "},{"$f":"IF(C30> 0,K30,\" \")","v":" "},{"$f":"IF(AND(C30>0,F51>0),IF(K4<13,ROUND((K31+K32)*C30*K30,2),C30*J37),0)","v":0},null,null,"Samliv/ antal børn",{"$f":"VLOOKUP(C15,Samliv,3,FALSE)","v":0},{"$f":"IF(AND(C17+C18+C19>1,L52=1,I53=2),1,IF(C17+C18+C19>=2,2,C17+C18+C19))","v":0},{"$f":"IF(AND(L52>0,I53>0),L52&I53&J53,0)-0","v":0}]
[null,"    Punktsanktion §§ 39-40",{"$f":"IF(K4<13,IF(AND(C31=\"Ja\",F51>0),\"(\"&K34&\" + \"&K35&\") * \",\" \"),\" \")","v":" "},{"$f":"IF(C31=\"Ja\",K30,\" \")","v":" "},{"$f":"IF(AND(C31=\"Ja\",F51>0),IF(K4<13,ROUND((K34+K35)*K30,2),K37),0)","v":0},null,null,"Loft sats",{"$f":"VLOOKUP(K53,Loftmap,2,FALSE)","v":0},{"$f":"VLOOKUP(I54,HTFsats,3,FALSE)","v":" - "}]
[null,"    § 40 a - udeblivelser",{"$f":"IF(C32>0,C32&\"/\"&I5&\" af \",\" \")","v":" "},{"$f":"IF(C32>0,F46,\" \")","v":" "},{"$f":"F46*C32/I5","v":0}]
[null,{"$f":"IF(I42>0,\"    Sanktion uberettiget hjælp § \"&I42,\"    Sanktion uberettiget hjælp §§ 42-43 \")","v":"    Sanktion uberettiget hjælp §§ 42-43 "},{"$f":"IF(I42=42,C34&\"/\"&K5&\" * 1/3 *\",\" \")","v":" "},{"$f":"IF(I42=42,F51,\" \")","v":" "},{"$f":"L43","v":0}]
[null,"    Manuel sanktion",null,null,{"$f":"C35","v":0}]
[null,"Sanktioner i alt",null,null,{"$f":"SUM(E52:E57)","v":0},{"$f":"-MIN(E58,F51)","v":0}]
[null,"Bruttoydelse",null,null,null,{"$f":"SUM(F51:F58)","v":0},null,"Fejl",{"$f":"IF(AND(I7=2,I14=3),1,IF(AND(I7<3,I8=2),2,IF(AND(I7=3,I8=1),3,IF(AND(I7=3,I4<9,D4=2015),4,))))","v":0}]
[null,{"$f":"IF(I42>0,\"Tilbagebetalingspligtig sanktion jf. § \"&I42,\" \")","v":" "},{"$f":"IF(L44>0,C34&\"/\"&K5&\" af\",\" \")","v":" "},{"$f":"IF(L44>0,F51-E56,\" \")","v":" "},null,{"$f":"IF(I42>0,MIN(L44,F59),\" \")","v":" "}]
[]
[null,"ATP egen andel"," "," "," ",{"$f":"IF(AND(F59>=K46,C37>=12),I47*K5/I5,0)","v":0}]
[null,"ATP kommuneandel",null,null,null,{"$f":"IF(AND(F59>=K46,C37>=12),J47*K5/I5,0)","v":0}]
[null,"OP-bidrag",null,null,null,{"$f":"IF(I7<3,ROUND((F59-F62)*I48,0),0)","v":0}]
[null,null,null,null,null,null,null,null,{"$f":"TEXT(K26,\"%\")","v":"%"}]
[null,"Kontanthjælpsloft",{"$f":"IF(I54>0,VLOOKUP(I54,HTFsats,3,FALSE),\" \")","v":" "},null,null,{"$f":"VLOOKUP(I54,HTFsats,K4,FALSE)","v":0}]

{"sheet":"Ægtefælle 2","index":3,"n_rows":66,"n_cols":18,"rows_kept":66,"cut":false,"hidden":false,"merged":[[32,14,32,17],[1,1,1,5],[2,14,2,17],[4,15,5,15],[4,16,5,16],[4,17,5,17],[26,14,26,17],[27,13,27,18],[28,14,28,17],[29,14,29,17],[30,14,30,17],[31,14,31,17],[44,14,44,17],[33,14,33,17],[34,14,34,17],[35,14,35,17],[36,14,36,17],[37,14,37,17],[38,14,38,17],[39,14,39,17],[40,14,40,17],[41,14,41,17],[42,14,42,17],[43,14,43,17],[59,14,59,17],[45,14,45,17],[46,14,46,17],[47,14,47,17],[48,14,48,17],[49,14,49,17],[50,14,50,17],[54,14,54,17],[55,14,55,17],[56,14,56,17],[57,14,57,17],[58,14,58,17],[66,14,66,17],[60,14,60,17],[62,14,62,17],[64,14,64,17],[65,14,65,17]]}
[]
[null,"Kontanthjælp, uddannelseshjælp og integrationsydelse/SHOY",null,null,null,null,null,"Mellemregninger",null,null,{"$f":"'Ægtefælle 1'!C5","v":0},{"$f":"'Ægtefælle 1'!D5","v":0}]
[null,null,null,null,null,null,null,"Fra - til / §",{"$f":"'Ægtefælle 1'!I3","v":"2019-11-01"},{"$f":"'Ægtefælle 1'!J3","v":"2019-11-30"},{"$f":"IF(D4<2020,2,3)","v":2},null,null,null,"Input til KY"]
[null,"Måned /år",{"$f":"'Ægtefælle 1'!C4","v":"November"},{"$f":"'Ægtefælle 1'!D4","v":2019},null,null,null,"måned/år/kolonne",{"$f":"VLOOKUP(C4,Måneder,2,FALSE)","v":11},{"$f":"VLOOKUP(I4,måned_år,VLOOKUP(D4,Tabel14[],2,FALSE),FALSE)","v":2019},{"$f":"VLOOKUP(J4,Tabel26[[Kolonne1]:[kolonne]],2,FALSE)","v":12}]
[null,"Dag - fra-til",{"$f":"IF(K2>0,'Ægtefælle 1'!C5,\" \")","v":" "},{"$f":"IF(L2>0,'Ægtefælle 1'!D5,\" \")","v":" "},null,null,null,"måned/periode/-afbrydelse",{"$f":"VLOOKUP(C4,Tabel211[],D4-2012,FALSE)","v":30},{"$f":"J3-I3+1","v":30},{"$f":"J5-C6","v":30},null,null,null,null,"Resultat fra            KMD Aktiv","Resultat fra      Ny beregning","Indberetning til KY"]
[null,"Midlertidig afbrydelse",0,null,null,null,null,"Satsvalg",{"$f":"(I7&J14&J18&J17&J15&J16)+0","v":0},{"$f":"VLOOKUP(I6,Satsmap_1,2,FALSE)","v":0},{"$f":"VLOOKUP(J6,Satsmap,2,FALSE)","v":0}]
["Person",null,null,null,null,null,null,"Bevilling",{"$f":"VLOOKUP(C8,Bevilling,2,FALSE)","v":0},"Grundsats",{"$f":"VLOOKUP(K6,Alle_sats,K4,FALSE)","v":0}]
[null,"Bevilling","Vælg",null,null,null,null,"Tillæg / reduktion dansktil",{"$f":"VLOOKUP(C9,Tillæg,2,FALSE)","v":0},{"$f":"IF(OR(I8=0,AND(I7=3,I8=1),AND(I7<3,I8=2)),0,VLOOKUP(J6,Satsmap,3,FALSE))","v":0},{"$f":"VLOOKUP(J8,Alle_sats,K4,FALSE)","v":0},null,null,null,"Bruttoydelse",null,{"$f":"F59","v":0},{"$f":"Q8-P8","v":0}]
[null,"Tillæg","Nej",null,null,null,null,"Ydelse i alt",null,{"$f":"K7+K8+L8","v":0},{"$f":"K7+K8+K21","v":0},null,null,null,"ATP egen andel",null,{"$f":"F62","v":0},{"$f":"Q9-P9","v":0}]
[null," - Fiktivt niveau integrationsydelse","Vælg",null,null,null,null,"Fiktivt niveau",{"$f":"IF(AND(I12=0,I7<3),0,IF(I12=3,3,VLOOKUP(C10,Fiktivt_niveau,2,FALSE)))","v":0},{"$f":"IF(I7=3,VLOOKUP(C10,Fiktivt_niveau,3,FALSE),IF(I10=3,'Ægtefælle 1'!J8,0))","v":0},{"$f":"IF(I10>0,(I10&K14&K18&K17&K15&K16)+0,0)","v":0},{"$f":"VLOOKUP(K10,Satsmap_1,2,FALSE)","v":0},null,null,"ATP kommuneandel",null,{"$f":"F63","v":0},{"$f":"Q10-P10","v":0}]
[null,null,null,null,null,null,null,"Fiktiv grund/akt.tllæg",{"$f":"VLOOKUP(L10,Satsmap,2,FALSE)","v":0},{"$f":"VLOOKUP(I11,Alle_sats,K4,FALSE)","v":0},{"$f":"IF(J10>0,VLOOKUP(L10,Satsmap,3,FALSE),0)","v":0},{"$f":"VLOOKUP(K11,Alle_sats,K4,FALSE)","v":0},null,null,"Periode fra",null,{"$f":"I3","v":"2019-11-01"},{"$f":"I3","v":"2019-11-01"}]
[null,"Alder","Vælg",null,null,null,null,"Dasktillæg/Ægtefælle reduktion",{"$f":"IF(AND(I7<3,'Ægtefælle 1'!I7=3,I17>1),3,0)","v":0},{"$f":"J11+L11","v":0},{"$f":"IF(I12=3,K9-'Ægtefælle 1'!K9,0)","v":0},{"$f":"MAX(K9-MAX(J12,K12),0)","v":0},null,null,"Periode til",null,{"$f":"J3","v":"2019-11-30"},{"$f":"J3","v":"2019-11-30"}]
[null,"Bosted person","Vælg",null,null,null,null,"Ægtefællereduktion korrigeret for indtægt",{"$f":"K9-L12-E47-E48","v":0},{"$f":"'Ægtefælle 1'!I13","v":0},{"$f":"IF(OR(I13<0,J13<0),0,IF(I12=3,1,0))","v":0},{"$f":"IF(I7=3,K7,IF(I10=3,MIN(K9,J11),0))","v":0},null,null,"Tilbagebetaling sanktion",null,{"$f":"F60","v":" "},{"$f":"IF(Q13=\" \",\" \",Q13-P13)","v":" "}]
[null,"Gravid / psykisk lidelse","Nej",null,null,null,null,"Alder",{"$f":"VLOOKUP(C12,Tabel8[],2,FALSE)","v":0},{"$f":"IF(AND(I7=3,J18=2),3,IF(AND(I7=3,I14<3),2,IF(AND(I14<3,J18=2),2,IF(AND(I14<3,I16=1),2,IF(AND(I14<3,I16=2,I15=2),2,I14)))))","v":0},{"$f":"IF(AND(I10=3,K18=2),3,IF(AND(I10=3,I14<3),2,IF(AND(I14<3,K18=2),2,IF(AND(I14<3,I16=1),2,IF(AND(I14<3,I16=2,I15=2),2,I14)))))","v":0},null,null,null,"Tilbagebetalingsparagraf",null,{"$f":"IF(I44>0,K44,\" \")","v":" "},{"$f":"Q14","v":" "}]
[null,"Enlig/samlevende",{"$f":"'Ægtefælle 1'!C15","v":"Vælg"},null,null,null,null,"bosted",{"$f":"IFERROR(VLOOKUP(C13,Tabel12[],2,FALSE),0)","v":0},{"$f":"IF(OR(I14=3,J16=1,J18=2),0,I15)","v":0},{"$f":"IF(OR(I14=3,K16=1,K18=2),0,I15)","v":0}," ",null,null,"Tilbagebetalingspligt"]
["Børn",null,null,null,null,null,null,"unge opl.",{"$f":"VLOOKUP(C14,Ungekode,2,FALSE)","v":0},{"$f":"IF(OR(I14=3,I7=3),0,IF(AND(I16=1,J18=2,I17=1),0,IF(AND(I8=1,J18=2),0,I16)))","v":0},{"$f":"IF(OR(I14=3,I10=3),0,IF(AND(I16=1,K18=2,I17=1),0,I16))","v":0},null,null,null,"Tilbagebetalingsparagraf"]
[null,"Antal hjemmeboende",0,null,null,null,null,"Samliv",{"$f":"VLOOKUP(C15,Samliv,2,FALSE)","v":0},{"$f":"IF(J18=0,0,IF(AND(I7=1,I14=3),0,IF(AND(I7<3,I16=2),0,IF(I17>1,0,I17))))","v":0},{"$f":"IF(K18=0,0,IF(AND(I10=1,I14=3),0,IF(AND(I10<3,I16=2),0,IF(I17>1,0,I17))))","v":0}]
[null,"Antal udeboende børn med bidrag",0,null,null,null,null,"Forsørger",{"$f":"IF(C17>0,2,IF(C18+C19>0,1,0))","v":0},{"$f":"IF(I18=2,2,IF(AND(I7=3,I18<2),0,IF(AND(I14=3,I18>0),2,IF(AND(I16=2,I18>0),2,0))))","v":0},{"$f":"IF(I18=2,2,IF(AND(I10=3,I18<2),0,IF(AND(I14=3,I18>0),2,IF(AND(I16=2,I18>0),2,0))))","v":0},null,null,null,"Kontanthjælploft",null,{"$f":"C66","v":" "},{"$f":"F66","v":0}]
[null,"Antal udeboende børn uden bidrag",0,null,null,null,null,"Fiktivt bidrag",{"$f":"IF(AND(J15>0,C18>0),1,0)","v":0},null,{"$f":"J20*C18*I19","v":0},null,null,null,"Hjælpsbeløb",null,null,{"$f":"F51","v":0}]
["Indtægt",null,null,null,null,null,null,"bidrag",{"$f":"IF(I7=3,0,IF(AND(J15>0,C18>0),1,0))","v":0},{"$f":"VLOOKUP(12,Alle_sats,K4,FALSE)","v":1387},{"$f":"J20*C18*I20","v":0},null,null,null,"fradragsfri indtægt",null,null,{"$f":"E48","v":0}]
[null,"Arbejdsindtægt i måneden ",0,null,null,null,null,"nedsat bidrag",{"$f":"IF(I7=1,12,IF(I7=2,60,0))","v":0},{"$f":"VLOOKUP(1,Alle_sats,K4,FALSE)","v":15180},{"$f":"MAX(MIN(K20,J21-K8-K7),0)","v":0},null,null,null,"225-timers sanktion",null,null,{"$f":"E52","v":0}]
[null," - Arbejdstimer i måneden",0,null,null,null,null,null,null,null,null,null,null,null,"Øvrige sanktioner",null,null,{"$f":"E58-E52","v":0}]
[null,"Arbejdsindtægt ukendt arbejdstid",0,null,null,null,null,"Timer i alt/sats timefradrag",{"$f":"ROUND(C22+C24,2)","v":0},{"$f":"VLOOKUP(121,Alle_sats,K4,FALSE)","v":27.32},{"$f":"VLOOKUP(122,HTFsats,K4,FALSE)","v":241.73},null,null,null,"Særlig støtte"]
[null," - Beregnet timetal",{"$f":"C23/K23","v":0},null,null,null,null,"Intægtsoverskud",{"$f":"MAX(E47+E48-F46,0)","v":0},null,null,null,null,null,"Særlig støtte ",null,null,{"$f":"'SÆS - ægtepar'!D79","v":0}]
[null,"Anden bruttoydelse",0,null,null,null,null,null,null,null,null,null,null,null,"Særlig støtte - terminshjælp",null,null,{"$f":"'SÆS - ægtepar'!D80","v":0}]
[null,"Anden skattepligtig indtægt",0,null,null,null,null,"225-timer",{"$f":"VLOOKUP(IF(I18>0,134,133),Alle_sats,K4,FALSE)","v":11423},{"$f":"IF(AND(I27=1,NOT(I10=3)),IF(L26=1,131,IF(OR(I7=1,I8=1,J6=\"23.2.3\"),132,0)),0)","v":0},{"$f":"VLOOKUP(J26,Alle_sats,K4,FALSE)","v":0},{"$f":"IF(J9>=I26,1,0)","v":0}]
[null,"Ikke skattepligtig indtægt",0,null,null,null,null,"Nedsættelse",{"$f":"VLOOKUP(C29,timeregel,2,FALSE)","v":0},{"$f":"IF(AND(I27=2,I17=3),(IF(OR(I7=3,I10=3),8,IF(AND(L26=1,'Ægtefælle 1'!L26=1),5,7))),0)","v":0}]
["Sanktioner",null,null,null,null,null,null,"Beregnet nedættelse 5/7/8",{"$f":"IF(J27=5,K9,0)","v":0},{"$f":"MAX(IF(J27=7,J9+'Ægtefælle 1'!J9-'Ægtefælle 1'!I26,0),0)","v":0},{"$f":"IF(L13+'Ægtefælle 1'!L13>='Ægtefælle 1'!I26,MAX('Ægtefælle 1'!L13-(I26-'Ægtefælle 1'!L13),0),0)","v":0},{"$f":"IF(K26>0,K26,IF(J27=5,I28,IF(J27=7,J28,IF(J27=8,K28,0))))","v":0},null,"Noter"]
[null,"225-timers regel","Nej"]
[null,"Periode sanktion (§§ 36-38) antal dage",0,null,null,null,null,"Sanktioner"," fradragspct. ",{"$f":"IF(K4<13,ROUND(F51/MAX(E41+E42,1),4),0)","v":0},{"$f":"IF(J30>0,J30,\" \")","v":" "}]
[null,"Punktsanktion (§§ 39-40)","Nej",null,null,null,null,"Periodesanktion","grundsats",{"$f":"VLOOKUP(J6,Satsmap,4,FALSE)","v":0},{"$f":"VLOOKUP(J31,Alle_sats,K4,FALSE)","v":0}]
[null,"40a - dage uden hjælp",0,null,null,null,null,null,"tillæg",{"$f":"IF(I8>0,VLOOKUP(J6,Satsmap,5,FALSE),0)","v":0},{"$f":"VLOOKUP(J32,Alle_sats,K4,FALSE)","v":0}]
[null,"Sanktion uberettiget hjælp §§ 42-43","Vælg"]
[null,"§§ 42-43 antal dage",0,null,null,null,null,"Punktsanktion","grundsats",{"$f":"VLOOKUP(J6,Satsmap,6,FALSE)","v":0},{"$f":"VLOOKUP(J34,Alle_sats,K4,FALSE)","v":0}]
[null,"Manuel sanktion",0,null,null,null,null,null,"tillæg",{"$f":"IF(I8>0,VLOOKUP(J6,Satsmap,7,FALSE),0)","v":0},{"$f":"VLOOKUP(J35,Alle_sats,K4,FALSE)","v":0}]
["ATP"]
[null,"Antal måneder med hjælp",0]
[" "]
[null,{"$f":"\"Beregning af \"&C8","v":"Beregning af Vælg"},null,{"$f":"I3","v":"2019-11-01"},{"$f":"J3","v":"2019-11-30"},{"$f":"K5&\" af \"&I5&\" dage\"","v":"30 af 30 dage"},null,"Sanktion 2020",{"$f":"E41+E42+E43","v":0},{"$f":"IF(K4>11,IF(I39>I40,J40,IF(I39>I41,J41,IF(I39>I42,J42,J43))),0)","v":0},{"$f":"3*J39","v":0}]
[null,null,null," ",null,null,null,null,{"$f":"VLOOKUP(301,HTFsats,K4,FALSE)","v":0},{"$f":"VLOOKUP(305,HTFsats,K4,FALSE)","v":0}]
[null,{"$f":"C8","v":"Vælg"},{"$f":"VLOOKUP(K6,HTFsats,3,FALSE)","v":" - "},null,{"$f":"K7","v":0},null,null,null,{"$f":"VLOOKUP(302,HTFsats,K4,FALSE)","v":0},{"$f":"VLOOKUP(306,HTFsats,K4,FALSE)","v":0}]
[null,{"$f":"IF(J8>0,C9,\"    - \")","v":"    - "},{"$f":"VLOOKUP(J8,HTFsats,3,FALSE)","v":" - "},null,{"$f":"K8","v":0},null,null,null,{"$f":"VLOOKUP(303,HTFsats,K4,FALSE)","v":0},{"$f":"VLOOKUP(307,HTFsats,K4,FALSE)","v":0}]
[null,{"$f":"IF(AND(L12>0,I7=3),\"   Reduktion dansktillæg\",IF(AND(I10=3,L12>0),\"   Ægtefællereduktion § 26, stk. 2\",\" \"))","v":" "},{"$f":"IF(L8>0,K7+K8,\" \")","v":" "}," ",{"$f":"IF(AND(I10>0,K13=1),-L12,0)","v":0},null,null,null,0,{"$f":"VLOOKUP(308,HTFsats,K4,FALSE)","v":0}]
[null,{"$f":"IF(K21>0,\"Bidragstillæg\",\"     \")","v":"     "},{"$f":"IF(K21>0,VLOOKUP(I21,HTFsats,3,FALSE),\" \")","v":" "},{"$f":"IF(K33>0,K33,\" \")","v":" "},{"$f":"K21","v":0},null,null,"1/3 sanktion",{"$f":"IF(C34>0,IF(I45>=J45,42,43),0)","v":0},{"$f":"VLOOKUP(C33,pgf42_43,2,FALSE)","v":0},{"$f":"\"§ \"&I44","v":"§ 0"}]
[null,{"$f":"IF(I27=2,\"Nedsættelse 225-timer\",\" \")","v":" "},{"$f":"IF(AND(I27=2,J27>0),\"§ 26, stk. \"&J27,\" \")","v":" "},null,{"$f":"IF(I27=2,-L28,0)","v":0},null,null,"Ydelse/grænsebeløb/periode ydelse/nedsættelse",{"$f":"K7+K8-L8","v":0},{"$f":"VLOOKUP(47,HTFsats,K4,FALSE)","v":11423},{"$f":"F46*C34/K5","v":0},{"$f":"IF(I44=42,K45/3,IF(AND(I44=43,J44=4),K39,0))","v":0}]
[null,{"$f":"C8&\" inkl. tillæg\"","v":"Vælg inkl. tillæg"},null,{"$f":"K5&\" / \"&I5&\" af \"","v":"30 / 30 af "},{"$f":"SUM(E41:E45)","v":0},{"$f":"E46*K5/I5","v":0},null,"Tilbagebetaling (1+2/3/4+5)",{"$f":"IF(AND(J44<3,I44=43),K45/3,0)","v":0},{"$f":"IF(J44=3,K45-L45,0)","v":0},{"$f":"IF(J44>3,K45-L45,0)","v":0},{"$f":"MAX(I46,J46,K46)","v":0}]
[null,"   Indtægt i alt",null,null,{"$f":"C21+C23+C25+C26+C27","v":0}]
[null,"   Timefradrag",{"$f":"IF(I23>0,I23&\" timer á\", \" \")","v":" "},{"$f":"IF(I23>0,J23,\" \")","v":" "},{"$f":"-I23*J23","v":0},null,null,"ATP grænse forsørger/ ikke-forsørger",{"$f":"VLOOKUP(144,HTFsats,K4,FALSE)","v":15180},{"$f":"VLOOKUP(145,HTFsats,K4,FALSE)","v":11423},{"$f":"IF(I18>0,I48,J48)","v":11423}]
[null,"    Indtægtsoverskud fra ægtefælle",null,null,{"$f":"IF(I17=3,'Ægtefælle 1'!I24,0)","v":0},null,null,"ATP-sats egen / kommune",{"$f":"VLOOKUP(141,HTFsats,K4,FALSE)","v":95},{"$f":"VLOOKUP(142,HTFsats,K4,FALSE)","v":189}]
[null,"Indtægtsfradrag",null,null,{"$f":"SUM(E47:E49)","v":0},{"$f":"-MIN(MAX(E50,0),F46)","v":0},null,"OP-bidrag",{"$f":"VLOOKUP(143,HTFsats,K4,FALSE)","v":0}]
[null,{"$f":"\"Hjælpsbeløb\"&IF(OR(I9=2,J11=2),\" + dansktillæg\",\" \")","v":"Hjælpsbeløb "},null,null,null,{"$f":"MAX(SUM(F46:F50),0)","v":0}]
[null,{"$f":"IF(K4>6,\"    Nedsættelse 225-timer - enlig\",\"  \")","v":"    Nedsættelse 225-timer - enlig"},{"$f":"IF(K26>0,VLOOKUP(J26,Alle_sats,3,FALSE),\" \")","v":" "},null,{"$f":"K26","v":0},null,null,"Kontanthjælpsloft"]
[null,"    Periodesanktioner §§ 36-38",{"$f":"IF(AND(C30>0,F51>0),IF(K4<13,(\"(\"&K31&\" + \"&K32&\") * \"&C30&\" * \"),J39&\" * \"&C30),\" \")","v":" "},{"$f":"IF(C30> 0,K30,\" \")","v":" "},{"$f":"IF(AND(C30>0,F51>0),IF(K4<13,ROUND((K31+K32)*C30*K30,2),C30*J39),0)","v":0},null,null,"Grænsebeløb stk.1",{"$f":"VLOOKUP(1,HTFsats,K4,FALSE)","v":15180},{"$f":"VLOOKUP(2,HTFsats,K4,FALSE)","v":11423},{"$f":"IF(OR(AND(F46>=I53,I18>0),AND(F46>=J53,I18=0)),1,0)","v":0},{"$f":"IF('Ægtefælle 1'!J27=8,IF(K4<10,5,7),IF(J27=8,IF(K4<10,6,8),0))","v":0}]
[null,"    Punktsanktion §§ 39-40",{"$f":"IF(K4<13,IF(AND(C31=\"Ja\",F51>0),\"(\"&K34&\" + \"&K35&\") * \",\" \"),\" \")","v":" "},{"$f":"IF(C31=\"Ja\",K30,\" \")","v":" "},{"$f":"IF(AND(C31=\"Ja\",F51>0),IF(K4<13,ROUND((K34+K35)*K30,2),K39),0)","v":0},null,null,"Stk. 2,3,4/valgt stk.",{"$f":"IF(AND(K53=0,I7=1,I10=0),2,0)","v":0},{"$f":"IF(AND(K53=0,I7=2,I10=0),3,0)","v":0},{"$f":"IF(AND(K53=0,OR(I7=3,I10=3)),IF(K4>9,4,3),0)","v":0},{"$f":"IF(K4>6,MAX(K53,I54,J54,K54,L53),0)","v":0}]
[null,"    § 40 a - udeblivelser",{"$f":"IF(C32>0,C32&\"/\"&I5&\" af \",\" \")","v":" "},{"$f":"IF(C32>0,F46,\" \")","v":" "},{"$f":"F46*C32/I5","v":0},null,null,"Samliv/ antal børn",{"$f":"VLOOKUP(C15,Samliv,3,FALSE)","v":0},{"$f":"IF(AND(C17+C18+C19>1,L54=1,I55=2),1,IF(C17+C18+C19>=2,2,C17+C18+C19))","v":0},{"$f":"IF(AND(L54>0,I55>0),L54&I55&J55,0)-0","v":0}]
[null,{"$f":"IF(I44>0,\"    Sanktion uberettiget hjælp § \"&I44,\"    Sanktion uberettiget hjælp §§ 42-43 \")","v":"    Sanktion uberettiget hjælp §§ 42-43 "},{"$f":"IF(I44=42,C34&\"/\"&K5&\" * 1/3 *\",\" \")","v":" "},{"$f":"IF(I44=42,F51,\" \")","v":" "},{"$f":"L45","v":0},null,null,"Loft sats",{"$f":"VLOOKUP(K55,Loftmap,2,FALSE)","v":0},{"$f":"VLOOKUP(I56,HTFsats,3,FALSE)","v":" - "}]
[null,"    Manuel sanktion",null,null,{"$f":"C35","v":0}]
[null,"Sanktioner i alt",null,null,{"$f":"SUM(E52:E57)","v":0},{"$f":"-MIN(E58,F51)","v":0}]
[null,"Bruttoydelse",null,null,null,{"$f":"SUM(F51:F58)","v":0}]
[null,{"$f":"IF(I44>0,\"Tilbagebetalingspligtig sanktion jf. § \"&I44,\" \")","v":" "},{"$f":"IF(L46>0,C34&\"/\"&K5&\" af\",\" \")","v":" "},{"$f":"IF(L46>0,F51-E56,\" \")","v":" "},null,{"$f":"IF(I44>0,MIN(L46,F59),\" \")","v":" "}]
[null,null,null,null,null,null,null,"Fejl",{"$f":"IF(AND(I7=2,I14=3),1,IF(AND(I7<3,I8=2),2,IF(AND(I7=3,I8=1),3,IF(AND(I7=3,I4<9,D4=2015),4,))))","v":0}]
[null,"ATP egen andel"," "," "," ",{"$f":"IF(AND(F59>=K46,C37>=12),I47*K5/I5,0)","v":0}]
[null,"ATP kommuneandel",null,null,null,{"$f":"IF(AND(F59>=K46,C37>=12),J47*K5/I5,0)","v":0}]
[null,"OP-bidrag",null,null,null,{"$f":"IF(I7<3,ROUND((F59-F62)*I50,0),0)","v":0}]
[]
[null,"Kontanthjælpsloft",{"$f":"IF(I56>0,VLOOKUP(I56,HTFsats,3,FALSE),\" \")","v":" "},null,null,{"$f":"VLOOKUP(I56,HTFsats,K4,FALSE)","v":0}]

{"sheet":"SÆS - ægtepar","index":4,"n_rows":80,"n_cols":11,"rows_kept":80,"cut":false,"hidden":false,"merged":[[1,1,1,4]]}
[]
[null,"Særlig støtte"]
[]
[null,"Måned /år",{"$f":"'Ægtefælle 1'!C4","v":"November"},{"$f":"'Ægtefælle 1'!D4","v":2019},null,null,null,"Bevilling",{"$f":"'Ægtefælle 1'!I7","v":0},{"$f":"'Ægtefælle 2'!I7","v":0},{"$f":"Enlig!K4","v":12}]
[]
["Boligudgifter",null,"beløb","frekvens",null,null,null,null,"Boligudgifter pr. måned"]
[null,"Husleje",0,null,null,null,null,{"$f":"VLOOKUP(D7,Frekvens,2,FALSE)","v":1},{"$f":"C7/MAX(H7,1)","v":0}]
[null,"Boligstøtte",0,null,null,null,null,1,{"$f":"-C8/MAX(H8,1)","v":0}]
[null,"Varme",0,null,null,null,null,1,{"$f":"C9/MAX(H9,1)","v":0}]
[null,"El",0,null,null,null,null,1,0]
[null,"Gas",0,null,null,null,null,1,0]
[null,"Vand",0,null,null,null,null,1,0]
[null,"Ejendomsskat",0,null,null,null,null,1,0]
[null,"Ejendomsværdiskat",0,null,null,null,null,1,0]
[null,"Husforsikring",0,null,null,null,null,1,0]
[null,"Andre boligudgifter",0,null,null,null,null,1,0]
[null,"Indtægt fra lejer",0,null,null,null,null,1,{"$f":"-C17/MAX(H17,1)","v":0}]
[null,null,null,null,null,null,null,"I alt",{"$f":"SUM(I7:I17)","v":0}]
["Boliglån",null,"Ydelse","Rente + bidrag","Frekvens"]
[null,"Lån 1",0,0,null,null,null,{"$f":"VLOOKUP(E20,Frekvens,2,FALSE)","v":1},{"$f":"C20/MAX(H20,1)","v":0},{"$f":"D20/MAX(H20,1)","v":0}]
[null,"Lån 2",0,0,null,null,null,{"$f":"VLOOKUP(E21,Frekvens,2,FALSE)","v":1},{"$f":"C21/MAX(H21,1)","v":0},{"$f":"D21/MAX(H21,1)","v":0}]
[null,null,null,null,null,null,null,"lån i alt",{"$f":"SUM(I20:I21)","v":0},{"$f":"SUM(J20:J21)","v":0}]
["Udgifter til erhvervelse af indtægter",null,"Ægtefælle 1","Ægtefælle 2",null,null,null,"I alt",{"$f":"I18+I22-J23","v":0},{"$f":"C31*(J22-MAX(C30-I39,0))","v":0}]
[null,"Transport",0,0,null,null,null,"Grænsebeløb Æ1"]
[null,"Arbejdsredskaber m.v.",0,0,null,null,null,"H. børn",{"$f":"'Ægtefælle 1'!C17","v":0},{"$f":"IF(I25>0,VLOOKUP(152,HTFsats,K4,FALSE),0)","v":0},{"$f":"MAX(VLOOKUP(154,HTFsats,K4,FALSE)*(I25-1),0)","v":0}]
[null,null,null,null,null,null,null,"U. børn",{"$f":"'Ægtefælle 1'!C18+'Ægtefælle 1'!C19","v":0},{"$f":"IF(AND(I25=0,I26>0),VLOOKUP(153,HTFsats,K4,FALSE),IF(AND(I26=0,I25=0),VLOOKUP(151,HTFsats,K4,FALSE),0))","v":3050},{"$f":"MAX(VLOOKUP(155,HTFsats,K4,FALSE)*IF(J26=0,I26,(I26-1)),0)","v":0}]
["Feriepenge",null,0,0,null,null,null,"Grænsebeløb Æ2"]
[null,null,null,null,null,null,null,"H. børn",{"$f":"'Ægtefælle 2'!C17","v":0},{"$f":"IF(I28>0,VLOOKUP(152,HTFsats,K4,FALSE),0)","v":0},{"$f":"MAX(VLOOKUP(154,HTFsats,K4,FALSE)*(I28-1),0)","v":0}]
["Skattekort",null,null,null,null,null,null,"U. børn",{"$f":"'Ægtefælle 2'!C18+'Ægtefælle 2'!C19","v":0},{"$f":"IF(AND(I28=0,I29>0),VLOOKUP(153,HTFsats,K7,FALSE),IF(AND(I29=0,I28=0),VLOOKUP(151,HTFsats,K4,FALSE),0))","v":3050},{"$f":"MAX(VLOOKUP(155,HTFsats,K4,FALSE)*IF(J29=0,I29,(I29-1)),0)","v":0}]
[null,"Skattekort fradrag",0,0,"pr. måned",null,null,null,"Æ1","Æ2"]
[null,"Trækprocent",0,0,null,null,null,"Grænsebeløb",{"$f":"MAX((J25+J26)-(K25+K26),0)","v":3050},{"$f":"MAX(J28-K28+J29-K29,0)","v":3050}]
[]
["Loft for særlig støtte",null,null,null,null,null,null,"ATP",{"$f":"IF('Ægtefælle 1'!F62>0,1,0)","v":0},{"$f":"IF('Ægtefælle 2'!F62>0,1,0)","v":0}]
[null,"Hidtidig nettoindtægt",0,0,null,null,null,"SK.pl. Indtægter",{"$f":"'Ægtefælle 1'!C21+'Ægtefælle 1'!C23+'Ægtefælle 1'!C26","v":0},{"$f":"'Ægtefælle 2'!C21+'Ægtefælle 2'!C23+'Ægtefælle 2'!C26","v":0}]
[null,"Antal måneder med hjælp",0,0,null,null,null,"Bruttoydelse",{"$f":"'Ægtefælle 1'!F51","v":0},{"$f":"'Ægtefælle 2'!F51","v":0}]
[null,null,null,null,null,null,null,"ATP",{"$f":"IF(I33=1,IF(OR(AND(I25>0,I35>=I57),AND(I25=0,I35>=J57)),-K57,0),0)","v":0},{"$f":"IF(J28=1,IF(OR(AND(I28>0,J35>=I57),AND(I28=0,J35>=J57)),-K57,0),0)","v":0}]
[null,null,null,null,null,null,null,"Bruttoindtægt",{"$f":"SUM(I34:I36)","v":0},{"$f":"SUM(J34:J36)","v":0}]
[null,null,null,null,null,null,null,"Beregnet skat",{"$f":"ROUND((I37-C30)*C31,0)","v":0},{"$f":"ROUND((J37-D30)*D31,0)","v":0}]
[null,null,null,null,null,null,null,"Bruttoydelse",{"$f":"'Ægtefælle 1'!E46","v":0},{"$f":"'Ægtefælle 2'!E46","v":0}]
[null,null,null,null,null,null,null,"ATP",{"$f":"IF(I33=1,IF(OR(AND(I25>0,I39>=I57),AND(I25=0,I39>=J57)),-K57,0),0)","v":0},{"$f":"IF(J33=1,IF(OR(AND(I28>0,J39>=I57),AND(I28=0,J39>=J57)),-K57,0),0)","v":0}]
[null,null,null,null,null,null,null,"Beregnet skat",{"$f":"ROUND((I39+I40-C30)*C31,0)","v":0},{"$f":"ROUND((J39+J40-D30)*D31,0)","v":0}]
[null,"Beregning særlig støtte § 34"]
[null,null,null,null,null,null,null,"90% Hidtidig nettoindtægt",{"$f":"C34*0.9","v":0},{"$f":"D34*0.9","v":0},{"$f":"SUM(I43:J43)","v":0}]
[null,"  Boligudgift",{"$f":"E44/2","v":0},{"$f":"E44/2","v":0},{"$f":"I23","v":0},null,null,"Dagpengeloft (-ATP)"]
[null,"  Grænsebeløb",{"$f":"-I31","v":-3050},{"$f":"-J31","v":-3050},null,null,null,{"$f":"I54-I55","v":18677},{"$f":"H45-ROUND((H45-C30)*C31,0)","v":18677},{"$f":"H45-ROUND((H45-D30)*D31,0)","v":18677},{"$f":"SUM(I45:J45)","v":37354}]
[null,"Beregnet støtte 1",{"$f":"MAX(SUM(C44:C45),0)","v":0},{"$f":"MAX(SUM(D44:D45),0)","v":0},null,{"$f":"SUM(C46:D46)","v":0}]
[null,null,null,null,null,null,null,"Loft ikke-forsørger"]
[null,"  Bruttoydelse",{"$f":"I35","v":0},{"$f":"J35","v":0},null,null,null,{"$f":"J58","v":15085},{"$f":"H48-ROUND((H48-C30)*C31,0)","v":15085},{"$f":"K58","v":15085},{"$f":"J48-ROUND((J48-D30)*D31,0)","v":15085}]
[null,"  Beregnet ATP",{"$f":"I36","v":0},{"$f":"J36","v":0},null,null,null,null,{"$f":"IF(AND(I25+I26=0,I51=0),I48,0)","v":15085},null,{"$f":"IF(AND(I28+I29=0,J51=0),K48,0)","v":15085}]
[null,"  Bruttoindtægt",{"$f":"I34","v":0},{"$f":"J34","v":0},null,null,null,"Loft integrationsydelse"]
[null,"  Beregnet skat",{"$f":"-I38","v":0},{"$f":"-J38","v":0},null,null,null,{"$f":"IF(OR(I4=3,J4=3),VLOOKUP(157,HTFsats,K4,FALSE),0)","v":0},{"$f":"IF(OR(I4=3,J4=3),H51-ROUND((H51-C30)*C31,0),0)","v":0},{"$f":"IF(OR(I4=3,J4=3),H51-ROUND((H51-D30)*D31,0),0)","v":0}]
[null,"  Ikke-skattepligtig indtægt",{"$f":"'Ægtefælle 1'!C27","v":0},{"$f":"'Ægtefælle 1'!D27","v":0}]
[null,"  Feriepenge",{"$f":"C27","v":0},{"$f":"D27","v":0}]
[null,"  Transport m.m.",{"$f":"C24+C25","v":0},{"$f":"D24+D25","v":0},null,null,null,"Dagpenge max",{"$f":"VLOOKUP(156,HTFsats,K4,FALSE)","v":18866}]
[null,"Nettoindtægt",{"$f":"SUM(C48:C54)","v":0},{"$f":"SUM(D48:D54)","v":0},{"$f":"SUM(C55:D55)","v":0},null,null,"ATP af dagpenge",{"$f":"VLOOKUP(158,HTFsats,K4,FALSE)","v":189}]
[null,"  Fastsat bruttoydelse",{"$f":"I39","v":0},{"$f":"J39","v":0}]
[null,"  Beregnet ATP",{"$f":"I40","v":0},{"$f":"J40","v":0},null,null,null,"ATP  forsørger/ej fors/sats",{"$f":"VLOOKUP(144,HTFsats,K4,FALSE)","v":15180},{"$f":"VLOOKUP(145,HTFsats,K4,FALSE)","v":11423},{"$f":"VLOOKUP(141,HTFsats,K4,FALSE)","v":95}]
[null,"  Beregnet skat",{"$f":"-I41","v":0},{"$f":"-J41","v":0},null,null,null,"Loft ej-forsørger m/u ATP",{"$f":"VLOOKUP(1,HTFsats,K4,FALSE)","v":15180},{"$f":"IF(C35>=0,I58-K57,I58)","v":15085},{"$f":"IF(D35>=0,I58-K57,I58)","v":15085}]
[null,"Nettokontanthjælpsniveau",{"$f":"SUM(C56:C58)","v":0},{"$f":"SUM(D56:D58)","v":0},{"$f":"SUM(C59:D59)","v":0}]
[null,"Indtægtsoverskud",null,null,{"$f":"MAX(E55-E59,0)","v":0},{"$f":"-E60","v":0}]
[null,"Beregnet støtte jf. § 5",{"$f":"F61/2","v":0},{"$f":"F61/2","v":0},null,{"$f":"SUM(F46:F60)","v":0}]
[]
[null,"  Samlet nettoindtægt",null,null,{"$f":"E55+F61","v":0}]
[null,"  90% af hidtidig nettoindtægt",{"$f":"I43","v":0},{"$f":"J43","v":0},{"$f":"SUM(C64:D64)","v":0}]
[null,"Nedsættelse jf § 6, stk. 2",null,null,{"$f":"MAX(E63-E64,0)","v":0},{"$f":"-MIN(E65,F61)","v":0}]
[null,"Beregnet støtte jf. § 6, stk.2",{"$f":"F66/2","v":0},{"$f":"F66/2","v":0},null,{"$f":"SUM(F61:F65)","v":0}]
[]
[null,"Nettoindtægt inkl. SÆS § 5",{"$f":"C55+C61","v":0},{"$f":"D55+D61","v":0}]
[null,"Nettoindtægt inkl. SÆS § 6, stk. 2",{"$f":"C55+C66","v":0},{"$f":"D55+D66","v":0}]
[null,{"$f":"IF(OR(I49>0,K49>0),\"Loft ej forsørger jf. § 6, stk. 3\",IF(I51>0,\"Loft integrationsydelse jf. § 6, stk.4-5\",0))","v":"Loft ej forsørger jf. § 6, stk. 3"},{"$f":"MAX(I49,I51)","v":15085},{"$f":"MAX(K49,J51)","v":15085}]
[null,"Tillæg jf. jf. § 6 stk.  3-5",{"$f":"IF(C70>C69,MIN(C70,C68)-C69,0)","v":0},{"$f":"IF(D70>D69,MIN(D70,D68)-D69,0)","v":0}]
[null,"Beregnet støtte jf. § 6",{"$f":"C66+C71","v":0},{"$f":"D66+D71","v":0},{"$f":"C72+D72","v":0}]
[null,"Samlet nettoindtægt",null,null,{"$f":"E55+E72","v":0}]
[null,"Dagpengeloft jf. § 7",{"$f":"IF(AND(C35>3,D35>3),I45,0)","v":0},{"$f":"IF(AND(C35>3,D35>3),J45,0)","v":0},{"$f":"SUM(C74:D74)","v":0}]
[null,"Nedsættelse jf. § 7",{"$f":"IF(C74>0,IF(C72<=D72,-MIN(C72,E75/2),E75-MIN(D72,E75/2)),0)","v":0},{"$f":"IF(D74>0,-(E75+C75),0)","v":0},{"$f":"MAX(E73-E74,0)","v":0}]
[null,"Beregnet særlig støtte",{"$f":"C72+C75","v":0},{"$f":"D72+D75","v":0},{"$f":"SUM(C76:D76)","v":0}]
[]
[]
[null,"Ikke tilbagebetalingspligtig SÆS",{"$f":"C76-C80","v":0},{"$f":"D76-D80","v":0},{"$f":"E76-E80","v":0}]
[null,"Tilbagebetalingspligtig SÆS jf. § 92, stk. 1",{"$f":"IF(C76<=D76,MIN(C76,E80/2),E80-MIN(D76,E80/2))","v":0},{"$f":"MIN(D76,E80-C80)","v":0},{"$f":"MIN(I22-J23,E76)","v":0}]

{"sheet":"tabeller","index":5,"n_rows":68,"n_cols":18,"rows_kept":68,"cut":false,"hidden":true,"merged":[]}
["Måneder","Kolonne1","2015","2016","2017","2018","2019","2020","2021",null,null,"Bevilling","Kolonne1",null,"Fejl","Tekst",null,"Antal"]
["Januar",1,31,31,31,31,31,31,31,null,null,"Vælg",0,null,0,"    ",null,0]
["Februar",2,28,29,28,28,28,29,28,null,null,"Kontanthjælp",1,null,1,"Alder skal være under 30 år for uddannelseshjælp",null,1]
["Marts",3,31,31,31,31,31,31,31,null,null,"Uddannelseshjælp",2,null,2,"Dankbonus kan kun vælges for integrationsydelse",null,2]
["April",4,30,30,30,30,30,30,30,null,null,"Integrationsydelse/ SHOY",3,null,3,"Aktivitets- og barselstillæg kan ikke vælges for integrationsydelse",null,3]
["Maj",5,31,31,31,31,31,31,31,null,null,null,null,null,null,null,null,4]
["Juni",6,30,30,30,30,30,30,30,null,null,"Tillæg","Kolonne1",null,null,null,null,5]
["Juli",7,31,31,31,31,31,31,31,null,null,"Aktivitetstillæg",1,null,null,null,null,6]
["August",8,31,31,31,31,31,31,31,null,null,"Barselstillæg",1,null,null,null,null,7]
["September",9,30,30,30,30,30,30,30,null,null,"Dansktillæg/-bonus",2,null,null,null,null,8]
["Oktober",10,31,31,31,31,31,31,31,null,null,"Nej",0,null,null,null,null,9]
["November",11,30,30,30,30,30,30,30,null,null,null,null,null,null,null,null,10]
["December",12,31,31,31,31,31,31,31,null,null,"Alder","værdi",null,null,null,null,11]
[null,null,{"$f":"SUBTOTAL(109,Tabel211[2015])","v":365},{"$f":"SUBTOTAL(109,Tabel211[2016])","v":366},{"$f":"SUBTOTAL(109,Tabel211[2017])","v":365},{"$f":"SUBTOTAL(109,Tabel211[2018])","v":365},{"$f":"SUBTOTAL(109,Tabel211[2019])","v":365},{"$f":"SUBTOTAL(109,Tabel211[2021])","v":365},{"$f":"SUBTOTAL(109,Tabel211[2021])","v":365},null,null,"Vælg",0,null,null,null,null,12]
[null,null,null,null,null,null,null,null,null,null,null,"Under 25 år",1,null,null,null,null,13]
["År","Kolonne1","kolonne",null,"Ja","Årstal","Kolonne1",null,null,null,null,"25-29",2,null,null,null,null,14]
[null,"2015-1",4,null,"Nej",2015,2,null,null,null,null,"Over 30 år",3,null,null,null,null,15]
[2015,"2015-9",5,null,null,2016,3,null,null,null,null,null,null,null,null,null,null,16]
[2016,"2016-1",6,null,null,2017,4,null,null,null,null,"Samliv","Kolonne1","Kolonne2","Kolonne3",null,null,17]
[2016,"2016-10",7,null,null,2018,5,null,null,null,null,"Vælg",0,0,0,null,null,18]
[2017,"2017-1",8,null,null,2019,6,null,null,null,null,"Enlig",1,1,1,null,null,19]
[null,"2017-7",9,null,null,2020,7,null,null,null,null,"Samlevende",2,2,2,null,null,20]
[2018,"2018-1",10,null,null,2021,8,null,null,null,null,"Gift",3,2,3,null,null,21]
[null,"2018-7",11,null,null,null,null,null,null,null,null,null,null,null,null,null,null,22]
[2019,2019,12,null,null,null,null,null,null,null,null,null,null,null,null,null,null,23]
[2020,"2020 -1",13,null,null,null,null,null,null,null,null,"Bosted","Kolonne1",null,null,null,null,24]
[2020,"2020-4",14,null,null,null,null,null,null,null,null,"Vælg",0,null,null,null,null,25]
[null,2021,15,null,null,null,null,null,null,null,null,"Udeboende",2,null,null,null,null,26]
[null,null,null,null,null,null,null,null,null,null,null,"Hjemmeboende",1,null,null,null,null,27]
[null,null,null,null,null,null,null,null,null,null,null,null,null,null,null,null,null,28]
[null,"Kolonne1","Kolonne2","Kolonne3","Kolonne4","Kolonne5","Kolonne6","Kolonne7","Kolonne8","Kolonne9",null,"Ungekode","Kolonne1",null,null,null,null,29]
[null,null,2015,2016,2017,2018,2019,2020,2021,2022,null,"Nej",0,null,null,null,null,30]
[null,1,"2015-1","2016-1","2017-1","2018-1",2019,"2020 -1",2021,null,null,"Gravid ",1,null,null,null,null,31]
[null,2,"2015-1","2016-1","2017-1","2018-1",2019,"2020 -1",2021,null,null,"Psykisk syg",2,null,null,0]
[null,3,"2015-1","2016-1","2017-1","2018-1",2019,"2020 -1",2021]
[null,4,"2015-1","2016-1","2017-1","2018-1",2019,"2020-4",2021,null,null,"Fiktivt niveau","bevilling","tillæg"]
[null,5,"2015-1","2016-1","2017-1","2018-1",2019,"2020-4",2021,null,null,"Kontanthjælp /m",1,1]
[null,6,"2015-1","2016-1","2017-1","2018-1",2019,"2020-4",2021,null,null,"Kontanthjælp /u",1,0]
[null,7,"2015-1","2016-1","2017-7","2018-7",2019,"2020-4",2021,null,null,"Udd.hjælp /m",2,1]
[null,8,"2015-1","2016-1","2017-7","2018-7",2019,"2020-4",2021,null,null,"Udd.hjælp /u",2,0]
[null,9,"2015-9","2016-1","2017-7","2018-7",2019,"2020-4",2021,null,null," ",0,0]
[null,10,"2015-9","2016-10","2017-7","2018-7",2019,"2020-4",2021,null,null,"Vælg",0,0]
[null,11,"2015-9","2016-10","2017-7","2018-7",2019,"2020-4",2021]
[null,12,"2015-9","2016-10","2017-7","2018-7",2019,"2020-4",2021]
[]
[null,null,null,null,null,null,null,null,null,null,null,"§§42-43","Kolonne1"]
[null,null,null,null,null,null,null,null,null,null,null,"1. gang før 2020",1]
[null,null,null,null,null,null,null,null,null,null,null,"2. gang før 2020",2]
[null,null,null,null,null,null,null,null,null,null,null,"3. gang før 2020",3]
[null,null,null,null,null,null,null,null,null,null,null,"første 3 måneder",4]
[null,null,null,null,null,null,null,null,null,null,null,"efter 3 måneder",5]
[null,null,null,null,null,null,null,null,null,null,null,"Vælg",0]
[null,null,null,null,null,null,null,null,null,null,null,0,0]
[]
[null,null,null,null,null,null,null,null,null,null,null,"225-timers regel","Kolonne1"]
[null,null,null,null,null,null,null,null,null,null,null,"Nej",0]
[null,null,null,null,null,null,null,null,null,null,null,"Nedsæt som enlig",1]
[null,null,null,null,null,null,null,null,null,null,null,"Nedsæt som gift",2]
[]
[null,null,null,null,null,null,null,null,null,null,null," "]
[null,null,null,null,null,null,null,null,null,null,null,"Frekvens","Kolonne2"]
[null,null,null,null,null,null,null,null,null,null,null,"Månedlig",1]
[null,null,null,null,null,null,null,null,null,null,null,"Hver 2. måned",2]
[null,null,null,null,null,null,null,null,null,null,null,"Kvartalsvis",3]
[null,null,null,null,null,null,null,null,null,null,null,"Hver 4. måned",4]
[null,null,null,null,null,null,null,null,null,null,null,"Halvårlig",6]
[null,null,null,null,null,null,null,null,null,null,null,"Årlig",12]
[null,null,null,null,null,null,null,null,null,null,null,0,1]

{"sheet":"Satsmapning","index":6,"n_rows":46,"n_cols":15,"rows_kept":46,"cut":false,"hidden":true,"merged":[]}
[]
[null,null,null,null,null,1,2,3,4,5,6,7]
[null,"S","Kolonne2","Kolonne3",null,"Satsmap","Grundsats","Tillæg","Dagsank. Grundsats","Dagsank. Tillæg","Pun.sank. Grundsats","Pun.sank. Tillæg",null,"Loft","Kolonne1"]
[null,132000,"25.2.1","Fyldt 30 år, forsørger børn",null,"25.2.1",1,0,17,0,32,0,null,121,201]
[null,130000,"25.2.2","Fyldt 30 år, andre",null,"25.2.2",2,0,18,0,33,0,null,120,202]
[null,122100,"25.3.1","Enlige forsørgere under 30 år",null,"25.3.1",3,13,19,28,34,43,null,111,203]
[null,122000,"25.3.2","Forsørgere under 30 år, som ikke har erhvervet ret til ekstra børnetilskud",null,"25.3.2",4,14,20,29,35,44,null,112,204]
[null,122001,"25.3.3","Under 30 år, gravid",null,"25.3.3",5,0,21,0,36,0,null,110,205]
[null,120001,"25.3.3","Under 30 år, gravid",null,"25.3.4",6,0,22,0,37,0,null,221,211]
[null,122002,"25.3.4","Under 30 år, psykisk syg, forsørgelsespligt",null,"25.3.5",7,0,23,0,38,0,null,222,212]
[null,120022,"25.3.5","Under 30 år, psykisk syg, udeboende",null,"25.3.6",8,15,24,30,39,45,null,220,213]
[null,120020,"25.3.6","25-29 år, udeboende",null,"25.3.7",9,16,25,31,40,46,null,211,214]
[null,120012,"25.3.7","25-29 år, hjemmeboende",null,"25.3.8",10,0,26,0,41,0,null,212,215]
[null,120010,"25.3.7","25-29 år, hjemmeboende",null,"25.3.9",11,0,27,0,42,0,null,210,216]
[null,110020,"25.3.8","Under 25 år, udeboende",null,"23.2.1",51,61,67,76,82,91,null,321,221]
[null,110012,"25.3.9","Under 25 år, hjemmeboende",null,"23.2.2",52,62,68,77,83,92,null,322,222]
[null,110010,"25.3.9","Under 25 år, hjemmeboende",null,"23.2.3",53,0,69,0,84,0,null,320,223]
[null,222100,"23.2.1","Enlige forsørgere - under 30 år",null,"23.2.4",54,0,70,0,85,0,null,311,224]
[null,222000,"23.2.2","Forsørgere under 30 år, som ikke har erhvervet ret til ekstra børnetilskud",null,"23.2.5",55,0,71,0,86,0,null,312,225]
[null,220001,"23.2.3","Under 30 år, gravid (passeret 12. svangerskabsuge)",null,"23.2.6",56,63,72,78,87,93,null,310,226]
[null,222001,"23.2.3","Under 30 år, gravid (passeret 12. svangerskabsuge)",null,"23.2.7",57,64,73,79,88,94,null,421,231]
[null,222002,"23.2.4","Under 30 år, psykisk syg, forsørgelsespligt",null,"23.2.8",58,65,74,80,89,95,null,422,232]
[null,220022,"23.2.5","Under 30 år, psykisk syg, udeboende",null,"23.2.9",59,66,75,81,90,96,null,420,233]
[null,220020,"23.2.6","25-29 år, udeboende",null,"22.2.1",101,105,106,110,111,115,null,411,234]
[null,220012,"23.2.7","25-29 år, hjemmeboende",null,"22.2.2",102,105,107,110,112,115,null,412,235]
[null,220010,"23.2.7","25-29 år, hjemmeboende",null,"22.2.3",103,105,108,110,113,115,null,410,236]
[null,210020,"23.2.8","Under 25 år, udeboende",null,"22.2.4",104,105,109,110,114,115,null,521,231]
[null,210012,"23.2.9","Under 25 år, hjemmeboende",null,0,0,0,0,0,0,0,null,522,232]
[null,210010,"23.2.9","Under 25 år, hjemmeboende",null,null,null,null,null,null,null,null,null,520,233]
[null,332100,"22.2.1","Enlige forsørgere",null,null,null,null,null,null,null,null,null,621,234]
[null,332000,"22.2.2","Ikke-enlige forsørgere (samlevende og/eller gift)",null,null,null,null,null,null,null,null,null,622,235]
[null,330000,"22.2.3","Personer over 30 år og personer under 30 år, der ikke bor hos forældre",null,null,null,null,null,null,null,null,null,620,236]
[null,320020,"22.2.3","Personer over 30 år og personer under 30 år, der ikke bor hos forældre",null,null,null,null,null,null,null,null,null,721,241]
[null,320010,"22.2.4","Personer under 30 år, der bor hos forældre",null,null,null,null,null,null,null,null,null,722,242]
[null,0,0,null,null,null,null,null,null,null,null,null,null,720,243]
[null,100000,0,null,null,null,null,null,null,null,null,null,null,821,244]
[null,110000,0,null,null,null,null,null,null,null,null,null,null,822,245]
[null,120000,null,null,null,null,null,null,null,null,null,null,null,820,246]
[null,200000,null,null,null,null,null,null,null,null,null,null,null," "]
[null,210000,null,null,null,null,null,null,null,null,null,null,null,0,0]
[null,220000]
[null,230020]
[null,232120]
[null,232020]
[null,320000]
[null,20010]

{"sheet":"HTF-sats","index":7,"n_rows":204,"n_cols":16,"rows_kept":204,"cut":false,"hidden":false,"merged":[]}
[]
[1,2,3,4,5,6,7,8,9,10,11,12,13,14,15]
["S","Satser"," ","2015-1","2015-9","2016-1","2016-10","2017-1","2017-7","2018-1","2018-7","2019","2020","2020-4","2021","Kolonne1"]
[null,"Kontanthjælp"]
[1,"Fyldt 30 år, forsørger børn","§ 25, stk 2, nr. 1",14416,14416,14575,14575,14808,14808,14993,14993,15180,15355,15355,15547]
[2,"Fyldt 30 år, andre","§ 25, stk 2, nr. 2",10849,10849,10968,10968,11143,11143,11282,11282,11423,11554,11554,11698]
[3,"Enlige forsørgere under 30 år","§ 25 stk. 3 nr. 1",13779,13779,13931,13931,14154,14154,14331,14331,14510,14677,14677,14860]
[4,"Forsørgere under 30 år, samlevende","§ 25 stk. 3 nr. 2",9640,9640,9746,9746,9902,9902,10026,10026,10151,10268,10268,10396]
[5,"Under 30 år, gravid","§ 25 stk. 3 nr. 3",10849,10849,10968,10968,11143,11143,11282,11282,11423,11554,11554,11698]
[6,"Under 30 år, psykisk syg, forsørger","§ 25 stk. 3 nr. 4",14416,14416,14575,14575,14808,14808,14993,14993,15180,15355,15355,15547]
[7,"Under 30 år, psykisk syg, udeboende","§ 25 stk. 3 nr. 5",10849,10849,10968,10968,11143,11143,11282,11282,11423,11554,11554,11698]
[8,"25-29 år, udeboende","§ 25 stk. 3 nr. 6",6992,6992,7069,7069,7182,7182,7272,7272,7363,7448,7448,7541]
[9,"25-29 år, hjemmeboende","§ 25 stk. 3 nr. 7",3374,3374,3411,3411,3466,3466,3509,3509,3553,3594,3594,3639]
[10,"Under 25 år, udeboende","§ 25 stk. 3 nr. 8",6992,6992,7069,7069,7182,7182,7272,7272,7363,7448,7448,7541]
[11,"Under 25 år, hjemmeboende","§ 25 stk. 3 nr. 9",3374,3374,3411,3411,3466,3466,3509,3509,3553,3594,3594,3639]
[12,"bidrag","§ 25 stk. 4",1289,1289,1307,1307,1333,1333,1360,1360,1387,1415,1415,1433]
[null,"Aktivitetstillæg"]
[13,"Enlige forsørgere under 30 år","§ 25 stk. 9 nr. 1",637,637,644,644,654,654,662,662,670,678,678,686]
[14,"Forsørgere under 30 år, samlevende","§ 25 stk. 9 nr. 2",4776,4776,4829,4829,4906,4906,4967,4967,5029,5087,5087,5151]
[15,"25-29 år, udeboende","§ 25 stk. 9 nr. 3",3857,3857,3899,3899,3961,3961,4011,4011,4061,4106,4106,4159]
[16,"25-29 år, hjemmeboende","§ 25 stk. 9 nr. 4",7475,7475,7557,7557,7678,7678,7774,7774,7871,7962,7962,8062]
[null,"Periodesanktion"]
[17,"Fyldt 30 år, forsørger børn","§ 35, stk. 3",665,665,673,673,683,683,692,692,701,709]
[18,"Fyldt 30 år, andre","§ 35, stk. 3",501,501,506,506,514,514,521,521,527,533]
[19,"Enlige forsørgere under 30 år","§ 35, stk. 3",636,636,643,643,653,653,661,661,670,677]
[20,"Forsørgere under 30 år, samlevende","§ 35, stk. 3",445,445,450,450,457,457,463,463,469,474]
[21,"Under 30 år, gravid","§ 35, stk. 3",501,501,506,506,514,514,521,521,527,533]
[22,"Under 30 år, psykisk syg, forsørger","§ 35, stk. 3",665,665,673,673,683,683,692,692,701,709]
[23,"Under 30 år, psykisk syg, udeboende","§ 35, stk. 3",501,501,506,506,514,514,521,521,527,533]
[24,"25-29 år, udeboende","§ 35, stk. 3",323,323,326,326,331,331,336,336,340,344]
[25,"25-29 år, hjemmeboende","§ 35, stk. 3",156,156,157,157,160,160,162,162,164,166]
[26,"Under 25 år, udeboende","§ 35, stk. 3",323,323,326,326,331,331,336,336,340,344]
[27,"Under 25 år, hjemmeboende","§ 35, stk. 3",156,156,157,157,160,160,162,162,164,164]
[null,"Periodsanktion aktivitetstillæg"]
[28,"Enlige forsørgere under 30 år","§ 35, stk. 3",29,29,30,30,30,30,31,31,31,31]
[29,"Forsørgere under 30 år, samlevende","§ 35, stk. 3",220,220,223,223,226,226,229,229,232,235]
[30,"25-29 år, udeboende","§ 35, stk. 3",178,178,180,180,183,183,185,185,187,190]
[31,"25-29 år, hjemmeboende","§ 35, stk. 3",345,345,349,349,354,354,359,359,363,367]
[null,"Punktsanktion"]
[32,"Fyldt 30 år, forsørger børn","§ 40 stk. 1",1995,1995,2019,2019,2049,2049,2076,2076,2103,2127]
[33,"Fyldt 30 år, andre","§ 40 stk. 1",1503,1503,1518,1518,1542,1542,1563,1563,1581,1599]
[34,"Enlige forsørgere under 30 år","§ 40 stk. 1",1908,1908,1929,1929,1959,1959,1983,1983,2010,2031]
[35,"Forsørgere under 30 år, samlevende","§ 40 stk. 1",1335,1335,1350,1350,1371,1371,1389,1389,1407,1422]
[36,"Under 30 år, gravid","§ 40 stk. 1",1503,1503,1518,1518,1542,1542,1563,1563,1581,1599]
[37,"Under 30 år, psykisk syg, forsørger","§ 40 stk. 1",1995,1995,2019,2019,2049,2049,2076,2076,2103,2127]
[38,"Under 30 år, psykisk syg, udeboende","§ 40 stk. 1",1503,1503,1518,1518,1542,1542,1563,1563,1581,1599]
[39,"25-29 år, udeboende","§ 40 stk. 1",969,969,978,978,993,993,1008,1008,1020,1032]
[40,"25-29 år, hjemmeboende","§ 40 stk. 1",468,468,471,471,480,480,486,486,492,498]
[41,"Under 25 år, udeboende","§ 40 stk. 1",969,969,978,978,993,993,1008,1008,1020,1032]
[42,"Under 25 år, hjemmeboende","§ 40 stk. 1",468,468,471,471,480,480,486,486,492,498]
[null,"Punktsanktion aktivitetstillæg"," ",null,null,null,null,null,null,null,null," "]
[43,"Enlige forsørgere under 30 år","§ 40 stk. 1",87,87,90,90,90,90,93,93,93,93]
[44,"Forsørgere under 30 år, samlevende","§ 40 stk. 1",660,660,669,669,678,678,687,687,696,705]
[45,"25-29 år, udeboende","§ 40 stk. 1",534,534,540,540,549,549,555,555,561,570]
[46,"25-29 år, hjemmeboende","§ 40 stk. 1",1035,1035,1047,1047,1062,1062,1077,1077,1089,1101]
[null,"1/3-sanktion"]
[47,"Ydelsesgrænse 42/43","§ 42 stk. 1",10849,10849,10968,10968,11143,11143,11282,11282,11423,11554,11554,11698]
[]
[null,"Uddannelseshjælp"]
[51,"Enlige forsørgere under 30 år","§ 23 stk. 2 nr. 1",11888,11888,12019,12019,12211,12211,12364,12364,12519,12663,12663,12821]
[52,"Forsørgere under 30 år, samlevende","§ 23 stk. 2 nr. 2",8319,8319,8411,8411,8546,8546,8653,8653,8761,8862,8862,8973]
[53,"Under 30 år, gravid","§ 23 stk. 2 nr. 3",10849,10849,10968,10968,11143,11143,11282,11282,11423,11554,11554,11698]
[54,"Under 30 år, psykisk syg, forsørger","§ 23 stk. 2 nr. 4",14416,14416,14575,14575,14808,14808,14993,14993,15180,15355,15355,15547]
[55,"Under 30 år, psykisk syg, udeboende","§ 23 stk. 2 nr. 5",10849,10849,10968,10968,11143,11143,11282,11282,11423,11554,11554,11698]
[56,"25-29 år, udeboende","§ 23 stk. 2 nr. 6",5945,5945,6010,6010,6106,6106,6182,6182,6259,6331,6331,6410]
[57,"25-29 år, hjemmeboende","§ 23 stk. 2 nr. 7",2562,2562,2590,2590,2631,2631,2664,2664,2697,2728,2728,2762]
[58,"Under 25 år, udeboende","§ 23 stk. 2 nr. 8",5945,5945,6010,6010,6106,6106,6182,6182,6259,6331,6331,6410]
[59,"Under 25 år, hjemmeboende","§ 23 stk. 2 nr. 9",2562,2562,2590,2590,2631,2631,2664,2664,2697,2728,2728,2762]
[60,"Bidrag","§ 23, stk. 3",1289,1289,1307,1307,1333,1333,1360,1360,1387,1415,1415,15547]
[null,"Aktivitetstillæg"]
[61,"Enlige forsørgere under 30 år","§ 24 stk. 3 nr. 1",2528,2528,2556,2556,2597,2597,2629,2629,2662,2693,2693,2727]
[62,"Forsørgere under 30 år, samlevende","§ 24 stk. 3 nr. 2",6097,6097,6164,6164,6263,6263,6341,6341,6420,6494,6494,6575]
[63,"25-29 år, udeboende","§ 24 stk. 3 nr. 3",4904,4904,4958,4958,5037,5037,5100,5100,5164,5223,5223,5288]
[64,"25-29 år, hjemmeboende","§ 24 stk. 3 nr. 4",8287,8287,8378,8378,8512,8512,8618,8618,8726,8826,8826,8936]
[65,"Under 25 år, udeboende","§ 24 stk. 3 nr. 5",1047,1047,1059,1059,1076,1076,1089,1089,1103,1116,1116,1130]
[66,"Under 25 år, hjemmeboende","§ 24 stk. 3 nr. 6",812,812,821,821,834,834,844,844,855,865,865,876]
[null,"Periodesanktion"]
[67,"Enlige forsørgere under 30 år","§ 35, stk. 3",549,549,555,555,564,564,571,571,578,584]
[68,"Forsørgere under 30 år, samlevende","§ 35, stk. 3",384,384,388,388,394,394,399,399,404,409]
[69,"Under 30 år, gravid","§ 35, stk. 3",501,501,506,506,514,514,521,521,527,533]
[70,"Under 30 år, psykisk syg, forsørger","§ 35, stk. 3",665,665,673,673,683,683,692,692,701,709]
[71,"Under 30 år, psykisk syg, udeboende","§ 35, stk. 3",501,501,506,506,514,514,521,521,527,533]
[72,"25-29 år, udeboende","§ 35, stk. 3",274,274,277,277,282,282,285,285,289,292]
[73,"25-29 år, hjemmeboende","§ 35, stk. 3",118,118,120,120,121,121,123,123,124,126]
[74,"Under 25 år, udeboende","§ 35, stk. 3",274,274,277,277,282,282,285,285,289,292]
[75,"Under 25 år, hjemmeboende","§ 35, stk. 3",118,118,120,120,121,121,123,123,124,126]
[null,"Periodsanktion aktivitetstillæg"]
[76,"Enlige forsørgere under 30 år","§ 35, stk. 3",117,117,118,118,120,120,121,121,123,124]
[77,"Forsørgere under 30 år, samlevende","§ 35, stk. 3",281,281,284,284,289,289,293,293,296,300]
[78,"25-29 år, udeboende","§ 35, stk. 3",226,226,229,229,232,232,235,235,238,241]
[79,"25-29 år, hjemmeboende","§ 35, stk. 3",382,382,387,387,393,393,398,398,403,407]
[80,"Under 25 år, udeboende","§ 35, stk. 3",48,48,49,49,50,50,50,50,51,52]
[81,"Under 25 år, hjemmeboende","§ 35, stk. 3",37,37,38,38,38,38,39,39,39,40]
[null,"Punktsanktion",null,null,null,null,null,null,null,null,null," "]
[82,"Enlige forsørgere under 30 år","§ 40 stk. 1",1647,1647,1665,1665,1692,1692,1713,1713,1734,1752]
[83,"Forsørgere under 30 år, samlevende","§ 40 stk. 1",1152,1152,1164,1164,1182,1182,1197,1197,1212,1217]
[84,"Under 30 år, gravid","§ 40 stk. 1",1503,1503,1518,1518,1542,1542,1563,1563,1581,1599]
[85,"Under 30 år, psykisk syg, forsørger","§ 40 stk. 1",1995,1995,2019,2019,2049,2049,2076,2076,2103,2127]
[86,"Under 30 år, psykisk syg, udeboende","§ 40 stk. 1",1503,1503,1518,1518,1542,1542,1563,1563,1581,1599]
[87,"25-29 år, udeboende","§ 40 stk. 1",822,822,831,831,846,846,855,855,867,876]
[88,"25-29 år, hjemmeboende","§ 40 stk. 1",354,354,360,360,363,363,369,369,372,378]
[89,"Under 25 år, udeboende","§ 40 stk. 1",822,822,831,831,846,846,855,855,867,876]
[90,"Under 25 år, hjemmeboende","§ 40 stk. 1",354,354,360,360,363,363,369,369,372,378]
[null,"Punktsanktion aktivitetstillæg"," "]
[91,"Enlige forsørgere under 30 år","§ 40 stk. 1",351,351,354,354,360,360,363,363,369,372]
[92,"Forsørgere under 30 år, samlevende","§ 40 stk. 1",843,843,852,852,867,867,879,879,888,900]
[93,"25-29 år, udeboende","§ 40 stk. 1",678,678,687,687,696,696,705,705,714,723]
[94,"25-29 år, hjemmeboende","§ 40 stk. 1",1146,1146,1161,1161,1179,1179,1194,1194,1209,1221]
[95,"Under 25 år, udeboende","§ 40 stk. 1",144,144,147,147,150,150,150,150,153,156]
[96,"Under 25 år, hjemmeboende","§ 40 stk. 1",111,111,114,114,114,114,117,117,117,120]
[null,"Integrationsydelse"]
[101,"Enlige forsørgere  ","§ 22, stk.2 nr. 1",null,11888,12019,12019,12211,12211,12364,11993,12143,12283,12283,12437]
[102,"Forsørgere samlevende","§ 22, stk.2 nr. 2",null,8319,8411,8411,8546,8546,8653,8393,8498,8596,8596,8703]
[103,"Over 30 år eller udeboende","§ 22, stk.2 nr. 3",null,5945,6010,6010,6106,6106,6182,5997,6072,6142,6142,6219]
[104,"under 30 år","§ 22, stk.2 nr. 4",null,2562,2590,2590,2631,2631,2664,2584,2616,2646,2646,2679]
[105,"Dansktillæg","§ 22, stk. 5",null,1500,1517,1517,1541,1541,1560,1560,1580,1598,1598,1618]
[null,"Periodesanktion integrationsydelse"]
[106,"Enlige forsørgere  ","§ 35, stk. 3",null,549,555,555,564,564,571,554,561,567]
[107,"Forsørgere samlevende","§ 35, stk. 3",null,384,388,388,394,394,399,387,392,397]
[108,"Over 30 år eller udeboende","§ 35, stk. 3",null,274,277,277,282,282,285,277,280,283]
[109,"under 30 år","§ 35, stk. 3",null,118,120,120,121,121,123,119,120,121]
[110,"Dansktillæg",null,null,70,70,70,71,71,72,72,73,74]
[null,"Punktsanktion Integrationsydelse"]
[111,"Enlige forsørgere  ","§ 40 stk. 1",null,1647,1665,1665,1692,1692,1713,1662,1683,1702]
[112,"Forsørgere samlevende","§ 40 stk. 1",null,1152,1164,1164,1182,1182,1197,1161,1176,1190]
[113,"Over 30 år eller udeboende","§ 40 stk. 1",null,822,831,831,846,846,855,831,839,849]
[114,"under 30 år","§ 40 stk. 1",null,354,360,360,363,363,369,357,362,366]
[115,"Dansktillæg",null,null,210,210,210,213,213,216,216,219,222]
[null,"Indtægter"]
[121,"Fradrag pr. arbejdstime","§ 31, stk.1",25.38,25.38,25.74,25.74,26.25,26.25,26.78,26.78,27.32,27.84,27.84,28.4]
[122,"Omregningssats, ukendt arbejdstid","§ 31, stk.2",220.5,220.5,225.13,225.13,230.08,230.08,235.6,235.6,241.73,247.53,247.53,247.53]
[null,"Timeregel (1/10-16)"]
[131,"Nedsættelse enlige, høj sats","§ 13 g, stk. 1 nr. 1",null,null,null,1000,1016,1016,1029,1029,1042,1054,1054,1067]
[132,"nedsættelse enlige, lav sats","§ 13 g, stk. 1 nr. 2",null,null,null,500,508,508,514,514,520,526,526,533]
[133,"225-timer grænse, ikke-forsørgere",null,null,null,null,10968,11143,11143,11282,11282,11423,11554,11554,11698]
[134,"225-timer grænse, forsørgere",null,null,null,null,14575,14808,14808,14993,14993,15180,15355,15355,15547]
[null,"Sanktioner 2020"]
[301,"Gænsebeløb 1 - over",null,null,null,null,null,null,null,null,null,null,null,13550,13519]
[302,"Gænsebeløb 2 - over",null,null,null,null,null,null,null,null,null,null,null,9800,9935]
[303,"Gænsebeløb 3 - over",null,null,null,null,null,null,null,null,null,null,null,5549,5632]
[304,"Gænsebeløb 4",null,null,null,null,null,null,null,null,null,null,null,0]
[305,"Sanktion 1","§35, stk. 4",null,null,null,null,null,null,null,null,null,null,700,700]
[306,"Sanktion 2","§35, stk. 4",null,null,null,null,null,null,null,null,null,null,600,600]
[307,"Sanktion 3","§35, stk. 4",null,null,null,null,null,null,null,null,null,null,400,400]
[308,"Sanktion 4","§35, stk. 4",null,null,null,null,null,null,null,null,null,null,200,200]
[309,"Punktsanktion 1","§35, stk. 5",null,null,null,null,null,null,null,null,null,null,2100,2100]
[310,"Punktsanktion 2","§35, stk. 5",null,null,null,null,null,null,null,null,null,null,1800,1800]
[311,"Punktsanktion 3","§35, stk. 5",null,null,null,null,null,null,null,null,null,null,1200,1200]
[312,"Punktsanktion 4","§35, stk. 5",null,null,null,null,null,null,null,null,null,null,600,600]
[null,"ATP"]
[141,"ATP-bidrag pr. måne",null,90,90,95,95,95,95,95,95,95,95,95,95]
[142,"ATP-bidrag kommune",null,180,180,189,189,189,189,189,189,189,189,189,189]
[143,"OP-bidrag",null,null,null,null,null,null,null,null,null,null,3.0000000000000001E-3,3.0000000000000001E-3,6.0000000000000001E-3]
[144,"ATP-grænsebeløb - forsørger",null,14416,14416,14575,14575,14808,14808,14993,14993,15180,15355,15355,15547]
[145,"ATP-grænsebeløb - ikke-forsørger",null,10849,10849,10968,10968,11143,11143,11282,11282,11423,11554,11554,11698]
[null,"Særlig støtte"]
[151,"Grænsebeløb ikke-forsørger","§ 34, stk. 6",2850,2850,2900,2900,2950,2950,3000,3000,3050,3100,3100,3150]
[152,"Forsørger et hjemmeboende barn","§ 34, stk. 6",4050,4050,4100,4100,4200,4200,4300,4300,4400,4500,4500,4600]
[153,"Forsørger et udeboende barn","§ 34, stk. 6",4150,4150,4200,4200,4300,4300,4400,4400,4500,4600,4600,4700]
[154,"hjemmeboende barn ekstra","§ 34, stk. 6",750,750,800,800,800,800,800,800,850,850,850,850]
[155,"udeboende barn ekstra","§ 34, stk. 6",600,600,600,600,650,650,650,650,650,700,700,700]
[156,"Indtægtsgrænse efter 3 måneder","§ 34, stk. 6",17918,17918,18113,18113,18395,18403,18633,18633,18866,19083,19083,19322]
[157,"Grænse integrationsydelse","§34, stk. 8",null,null,null,null,12973,12973,13233,13233,13498,13767,13767,14043]
[158,"ATP af dagpenge",null,180,180,189,189,189,189,189,189,189,189,189,189]
[null,"Kontanthjælpsloft (1/10-16)",null,null,null,"  ","  "]
[null,"Sats § 25, stk. 2"]
[201,"Gifte/samlevende, forsørgere","§ 25b stk. 1 nr. 1",null,null,null,14575,14808,14808,14993,14993,15180,15355,15355,15547]
[202,"Gifte/samlevende, ikke forsørgere","§ 25b stk. 1 nr. 2",null,null,null,10968,11143,11143,11282,11282,11423,11554,11554,11698]
[203,"Enlige, forsørger, 1 barn","§ 25b stk. 1 nr. 3",null,null,null,15196,15439,15439,15632,15632,15827,16009,16009,16209]
[204,"Enlige, forsørger, 2 eller flere børn","§ 25b stk. 1 nr. 4",null,null,null,15554,15803,15803,16001,16001,16201,16387,16387,16592]
[205,"Enlige, ikke forsørger","§ 25b stk. 1 nr. 5",null,null,null,13265,13477,13477,13645,13645,13816,13975,13975,14150]
[" ","Sats § 25 stk. 3"]
[211,"Gifte/samlevende, 1 barn","§ 25b stk. 2 nr. 1",null,null,null,12444,12643,12643,12801,12801,12961,13110,13110,13274]
[212,"Gifte/samlevende, 2 eller flere børn","§ 25b stk. 2 nr. 2",null,null,null,12321,12518,12518,12674,12674,12832,12980,12980,13142]
[213,"Gifte/samlevende, ikke forsørgere","§ 25b stk. 2 nr. 3",null,null,null,9452,9603,9603,9723,9723,9845,9958,9958,10082]
[214,"Enlige, forsørger, 1 barn","§ 25b stk. 2 nr. 4",null,null,null,14896,15134,15134,15323,15323,15515,15693,15693,15889]
[215,"Enlige, forsørger, 2 eller flere børn","§ 25b stk. 2 nr. 5",null,null,null,15254,15498,15498,15692,15692,15888,16071,16071,16272]
[216,"Enlige, ikke forsørger","§ 25b stk. 2 nr. 6",null,null,null,10154,10316,10316,10445,10445,10576,10698,10698,10832]
[null,"Sats § 23 "]
[221,"Gifte/samlevende, 1 barn","§ 25b stk. 3 nr. 1",null,null,null,11867,12057,12057,12208,12208,12361,12503,12503,12659]
[222,"Gifte/samlevende, 2 eller flere børn","§ 25b stk. 3 nr. 2",null,null,null,11707,11894,11894,12043,12043,12194,12334,12334,12488]
[223,"Gifte/samlevende, ikke forsørgere","§ 25b stk. 3 nr. 3",null,null,null,9057,9202,9202,9317,9317,9433,9541,9541,9660]
[224,"Enlige, forsørger, 1 barn","§ 25b stk. 3 nr. 4",null,null,null,14172,14399,14399,14579,14579,14761,14931,14931,15118]
[225,"Enlige, forsørger, 2 eller flere børn","§ 25b stk. 3 nr. 5",null,null,null,14530,14762,14762,14947,14947,15134,15308,15308,15499]
[226,"Enlige, ikke forsørger","§ 25b stk. 3 nr. 6",null,null,null,9754,9910,9910,10034,10034,10159,10276,10276,10404]
[" ","Sats § 22, (nedsat 225-timer)","ændres 1/7-18"]
[231,"Gifte/samlevende, 1 barn","§ 25b stk. 4 nr. 1",null,null,null,9087,9232,9232,9347,11948,12097,12236,12236,12389]
[232,"Gifte/samlevende, 2 eller flere børn","§ 25b stk. 4 nr. 2",null,null,null,9154,9300,9300,9416,11783,11930,12067,12067,12218]
[233,"Gifte/samlevende, ikke forsørgere","§ 25b stk. 4 nr. 3",null,null,null,6118,6216,6216,6294,9132,9246,9352,9352,9469]
[234,"Enlige, forsørger, 1 barn","§ 25b stk. 4 nr. 4",null,null,null,6865,6975,6975,7062,14208,14386,14551,14551,14733]
[235,"Enlige, forsørger, 2 eller flere børn","§ 25b stk. 4 nr. 5",null,null,null,6932,7043,7043,7131,14576,14758,14928,14928,15115]
[236,"Enlige, ikke forsørger","§ 25b stk. 4 nr. 6",null,null,null,5077,5158,5158,5222,9848,9971,10086,10086,10212]
[null,"Sats § 22, nedsat 225-timer","indføres 1/7-18"]
[241,"Ej nedsat hjælp, forsørger, 1 barn","§ 25b stk. 5 nr. 1",null,null,null,null,null,null,null,9088,9202,9308,9308,9424]
[242,"Ej nedsat hjælp, forsørger, 2 eller flere børn","§ 25b stk. 5 nr. 2",null,null,null,null,null,null,null,9157,9271,9378,9378,9495]
[243,"Ej nedsat hjælp, ikke forsørger","§ 25b stk. 5 nr. 3",null,null,null,null,null,null,null,6108,6184,6255,6255,6333]
[244,"Nedsat hjælp, forsørger, 1 barn","§ 25b stk. 5 nr. 4",null,null,null,null,null,null,null,7322,7414,7499,7499,7593]
[245,"Nedsat hjælp, forsørger, 2 eller flere børn","§ 25b stk. 5 nr. 5",null,null,null,null,null,null,null,7391,7483,7569,7569,7664]
[246,"Nedsat hjælp, ikke forsørger","§ 25b stk. 5 nr. 6",null,null,null,null,null,null,null,5408,5476,5539,5539,5608]
[]
[]
[]
[]
[0,"Ingen sats"," - ",0,0,0,0,null,0,0,0,0,0,0,0]

{"sheet":"2021 sats","index":8,"n_rows":143,"n_cols":4,"rows_kept":143,"cut":false,"hidden":false,"merged":[[78,1,79,1],[78,2,79,2],[78,3,79,3],[127,0,128,0],[127,1,128,1],[127,2,128,2],[72,0,73,0],[72,1,73,1],[72,2,73,2],[74,0,75,0],[74,1,75,1],[74,2,75,2],[66,0,67,0],[66,1,67,1],[66,2,67,2],[43,0,44,0],[43,1,44,1],[43,2,44,2],[55,0,56,0],[55,1,56,1],[55,2,56,2],[61,1,63,1],[61,2,63,2],[64,0,65,0],[64,1,65,1],[64,2,65,2],[40,3,41,3],[26,0,27,0],[26,1,27,1],[26,2,27,2],[30,1,31,1],[30,2,31,2],[32,0,33,0],[32,1,33,1],[32,2,33,2],[34,0,35,0],[34,1,35,1],[34,2,35,2],[40,1,41,1],[40,2,41,2],[24,0,25,0],[24,1,25,1],[24,2,25,2],[0,0,0,3],[4,0,5,0],[4,1,5,1],[4,2,5,2],[14,0,14,3],[15,0,15,3],[17,0,18,0],[17,1,18,1],[17,2,18,2],[21,1,23,1],[21,2,23,2]]}
["Kontanthjælp"]
["Fyldt 30 år, forsørger børn","§ 25, stk. 2, nr. 1","Kr. pr. måned",15547]
["Fyldt 30 år, andre","§ 25, stk. 2, nr. 2","Kr. pr. måned",11698]
["Enlige forsørgere under 30 år","§ 25, stk. 3, nr. 1","Kr. pr. måned",14860]
["Forsørgere under 30 år, som ikke har erhvervet ret til ekstra børnetilskud","§ 25, stk. 3, nr. 2","Kr. pr. måned"]
[null,null,null,10396]
["Under 30 år, gravid (passeret 12. svangerskabsuge)","§ 25, stk. 3, nr. 3","Kr. pr. måned",11698]
["Under 30 år, psykisk syg, forsørgelsespligt","§ 25, stk. 3, nr. 4","Kr. pr. måned",15547]
["Under 30 år, psykisk syg, udeboende","§ 25, stk. 3, nr. 5","Kr. pr. måned",11698]
["25-29 år, udeboende","§ 25, stk. 3, nr. 6","Kr. pr. måned",7541]
["25-29 år, hjemmeboende","§ 25, stk. 3, nr. 7","Kr. pr. måned",3639]
["Under 25 år, udeboende","§ 25, stk. 3, nr. 8","Kr. pr. måned",7541]
["Under 25 år, hjemmeboende","§ 25, stk. 3, nr. 9","Kr. pr. måned",3639]
["Under 30 år, bidragspligt, maksimum hjælp inkl. tillæg","§ 25, stk. 4","Kr. pr. måned",15547]
[]
["Aktivitetstillæg/Barselstillæg til kontanthjælp"]
["Enlige forsørgere under 30 år","§ 25, stk. 9, nr. 1","Kr. pr. måned",686]
["Forsørgere under 30 år, som ikke har erhvervet ret til ekstra børnetilskud","§ 25, stk. 9, nr. 2","Kr. pr. måned"]
[null,null,null,5151]
["25-29 år, udeboende","§ 25, stk. 9, nr. 3","Kr. pr. måned",4159]
["25-29 år, hjemmeboende","§ 25, stk. 9, nr. 4","Kr. pr. måned",8062]
["Sanktionssatser – kontanthjælp. § 35, stk. 412) ","§ 35, stk. 4","Kr. pr. måned"]
["Sanktionssats ved en månedlig ydelsessats på mindre end 5.633 kr."]
[null,null,null,200]
["Sanktionssats ved en månedlig ydelsessats på mindst 5.633 kr. og højst 9.935 kr.","§ 35, stk. 4","Kr. pr. måned"]
[null,null,null,400]
["Sanktionssats ved en månedlig ydelsessats på mere end 9.935 kr. og højst 13.519 kr.","§ 35, stk. 4","Kr. pr. måned"]
[null,null,null,600]
["Sanktionssats ved en månedlig ydelsessats på mere end 13.519 kr.","§ 35, stk. 4","Kr. pr. måned",700]
[]
["Sanktionssatser – kontanthjælp. § 35, stk. 512) ","§ 35, stk. 5","Kr. pr. måned"]
["Sanktionssats ved en månedlig ydelsessats på mindre end 5.633 kr.",null,null,600]
["Sanktionssats ved en månedlig ydelsessats på mindst 5.633 kr. og højst 9.935 kr.","§ 35, stk. 5","Kr. pr. måned"]
[null,null,null,1200]
["Sanktionssats ved en månedlig ydelsessats på mere end 9.935 kr. og højst 13.519 kr.","§ 35, stk. 5","Kr. pr. måned"]
[null,null,null,1800]
["Sanktionssats ved en månedlig ydelsessats på mere end 13.519 kr.","§ 35, stk. 5","Kr. pr. måned",2100]
[]
["Sanktion ved uberettiget modtagelse af hjælp efter §§ 22-25 samtidig med arbejde eller ophold i udlandet"]
["Sanktionsgrænse","§ 42, stk. 1 og § 43, stk. 1","Kr. pr. måned",11698]
[]
["Uddannelseshjælp"]
["Enlige forsørgere under 30 år","§ 23, stk. 2, nr. 1","Kr. pr. måned",12821]
["Forsørgere under 30 år, som ikke har erhvervet ret til ekstra børnetilskud ","§ 23, stk. 2, nr. 2","Kr. pr. måned"]
[null,null,null,8973]
["Under 30 år, gravid (passeret 12. svangerskabsuge)","§ 23, stk. 2, nr. 3","Kr. pr. måned",11698]
["Under 30 år, psykisk syg, forsørgelsespligt","§ 23, stk. 2, nr. 4","Kr. pr. måned",15547]
["Under 30 år, psykisk syg, udeboende","§ 23, stk. 2, nr. 5","Kr. pr. måned",11698]
["25-29 år, udeboende","§ 23, stk. 2, nr. 6","Kr. pr. måned",6410]
["25-29 år, hjemmeboende","§ 23, stk. 2, nr. 7","Kr. pr. måned",2762]
["Under 25 år, udeboende","§ 23, stk. 2, nr. 8","Kr. pr. måned",6410]
["Under 25 år, hjemmeboende","§ 23, stk. 2, nr. 9","Kr. pr. måned",2762]
["Under 30 år, bidragspligt, maksimum hjælp inkl. tillæg","§ 23, stk. 3","Kr. pr. måned",15547]
["Aktivitetstillæg/Barselstillæg til uddannelseshjælp"]
["Enlige forsørgere under 30 år","§ 24, stk. 3, nr. 1","Kr. pr. måned",2727]
["Forsørgere under 30 år, som ikke har erhvervet ret til ekstra børnetilskud.","§ 24, stk. 3, nr. 2","Kr. pr. måned"]
[null,null,null,6575]
["25-29 år, udeboende","§ 24, stk. 3, nr. 3","Kr. pr. måned",5288]
["25-29 år, hjemmeboende","§ 24, stk. 3, nr. 4","Kr. pr. måned",8936]
["Under 25 år, udeboende","§ 24, stk. 3, nr. 5","Kr. pr. måned",1130]
["Under 25 år, hjemmeboende","§ 24, stk. 3, nr. 6","Kr. pr. måned",876]
[null,"§ 35, stk. 4","Kr. pr. måned"]
["Sanktionssatser – uddannelseshjælp. § 35, stk. 412)"]
["Sanktionssats ved en månedlig ydelsessats på mindre end 5.633 kr.",null,null,200]
["Sanktionssats ved en månedlig ydelsessats på mindst 5.633 kr. og højst 9.935 kr.","§ 35, stk. 4","Kr. pr. måned"]
[null,null,null,400]
["Sanktionssats ved en månedlig ydelsessats på mere end 9.935 kr. og højst 13.519 kr.","§ 35, stk. 4","Kr. pr. måned"]
[null,null,null,600]
["Sanktionssats ved en månedlig ydelsessats på mere end 13.519 kr.","§ 35, stk. 4","Kr. pr. måned",700]
[]
["Sanktionssatser – uddannelseshjælp. § 35, stk. 512)"]
["Sanktionssats ved en månedlig ydelsessats på mindre end 5.633 kr.","§ 35, stk. 5","Kr. pr. måned",600]
["Sanktionssats ved en månedlig ydelsessats på mindst 5.633 kr. og højst 9.935 kr.","§ 35, stk. 5","Kr. pr. måned"]
[null,null,null,1200]
["Sanktionssats ved en månedlig ydelsessats på mere end 9.935 kr. og højst 13.519 kr.","§ 35, stk. 5","Kr. pr. måned"]
[null,null,null,1800]
["Sanktionssats ved en månedlig ydelsessats på mere end 13.519 kr.","§ 35, stk. 5","Kr. pr. måned",2100]
[]
[]
["Sanktion ved uberettiget modtagelse af hjælp efter §§ 22-25 samtidig med arbejde eller ophold i udlandet"]
["Sanktionsgrænse","§ 42, stk. 1 og § 43, stk. 1","Kr. pr. måned",11698]
["Kontanthjælpsloft for modtagere af hjælp efter §§ 23-25 med et beløb svarende til satserne i § 25, stk. 2"]
["Gifte/samlevende, forsørgere","§ 25 b, stk. 1, nr. 1","Kr. pr. måned ",15547]
["Gifte/samlevende, ikke forsørgere","§ 25 b, stk. 1, nr. 2","Kr. pr. måned",11698]
["Enlige, forsørger, 1 barn","§ 25 b, stk. 1, nr. 3","Kr. pr. måned",16209]
["Enlige, forsørger, 2 eller flere børn","§ 25 b, stk. 1, nr. 4","Kr. pr. måned",16592]
["Enlige, ikke forsørger","§ 25 b, stk. 1, nr. 5","Kr. pr. måned",14150]
["Kontanthjælpsloft for modtagere af hjælp efter § 25, stk. 3, og som ikke er omfattet af § 25 b, stk. 1"]
["Gifte/samlevende, forsørgere, 1 barn","§ 25 b, stk. 2, nr. 1","Kr. pr. måned",13274]
["Gifte/samlevende, forsørgere, 2 eller flere børn","§ 25 b, stk. 2, nr. 2","Kr. pr. måned",13142]
["Gifte/samlevende, ikke forsørgere","§ 25 b, stk. 2, nr. 3","Kr. pr. måned",10082]
["Enlige, forsørger, 1 barn","§ 25 b, stk. 2, nr. 4","Kr. pr. måned",15889]
["Enlige, forsørger, 2 eller flere børn","§ 25 b, stk. 2, nr. 5","Kr. pr. måned",16272]
["Enlige, ikke forsørger","§ 25 b, stk. 2, nr. 6","Kr. pr. måned",10832]
["Kontanthjælpsloft for modtagere af hjælp efter §§ 23-24, eller som får beregnet hjælp efter § 26, stk. 2, og som ikke er omfattet af § 25 b, stk. 1"]
["Gifte/samlevende, forsørgere, 1 barn","§ 25 b, stk. 3, nr. 1","Kr. pr. måned",12659]
["Gifte/samlevende, forsørgere, 2 eller flere børn","§ 25 b, stk. 3, nr. 2","Kr. pr. måned",12488]
["Gifte/samlevende, ikke forsørgere","§ 25 b, stk. 3, nr. 3","Kr. pr. måned",9660]
["Enlige, forsørger, 1 barn","§ 25 b, stk. 3, nr. 4","Kr. pr. måned",15118]
["Enlige, forsørger, 2 eller flere børn","§ 25 b, stk. 3, nr. 5","Kr. pr. måned",15499]
["Enlige, ikke forsørger","§ 25 b, stk. 3, nr. 6","Kr. pr. måned",10404]
["Kontanthjælpsloft for ægtefæller, hvor en eller begge modtager selvforsørgelses- og hjemrejseydelse eller overgangsydelse, og som ikke opfylder 225 timers kravet (Ægtefæller omfattet af § 13 f, stk. 3 og 4)"]
["Ej nedsat hjælp, forsørger, 1 barn","§ 25 b, stk. 5, nr. 1","Kr. pr. måned",9424]
["Ej nedsat hjælp, forsørger, 2 eller flere børn","§ 25 b, stk. 5, nr. 2","Kr. pr. måned",9495]
["Ej nedsat hjælp, ikke forsørger","§ 25 b, stk. 5, nr. 3","Kr. pr. måned",6333]
["Nedsat hjælp, forsørger, 1 barn","§ 25 b, stk. 5, nr. 4","Kr. pr. måned",7593]
["Nedsat hjælp, forsørger, 2 eller flere børn","§ 25 b, stk. 5, nr. 5","Kr. pr. måned",7664]
["Nedsat hjælp, ikke forsørger","§ 25 b, stk. 5, nr. 6","Kr. pr. måned",5608]
["Nedsættelse af hjælpen til ugifte personer, der ikke opfylder kravet om 225 timers ordinært og ustøttet arbejde inden for de seneste 12 kalendermåneder"]
["Hjælp beregnet på baggrund af 15.547 kr./11.698 kr. pr. måned","§ 13 g, stk. 1, nr. 1","Kr. pr. måned",1067]
["Hjælp beregnet på baggrund af mindre end 15.547 kr./11.698 kr. pr. måned","§ 13 g, stk. 1, nr. 2","Kr. pr. måned",533]
["Omregningssats for ukendt arbejdstid til 225 timers-regel"]
["Omregningssats ","§ 13 f, stk. 15","Kr. pr. time",127.03]
["Ægtefælleberegning – 225 timers-regel"]
["Forsørgere","§ 26, stk. 5-8","Kr. pr. måned",15547]
["Ikke-forsørgere","§ 26, stk. 5-8","Kr. pr. måned",11698]
["Engangshjælp"]
["Over 25 år, samt udeboende under 25 år (maksimum)","§ 25 a, stk. 2","Kr. pr. måned",6252]
["Hjemmeboende under 25 år (maksimum)","§ 25 a, stk. 3","Kr. pr. måned",3108]
["Hjælp til visse persongrupper"]
["Nået efterlønsalderen, ikke optjent pensionsret","§ 27, stk. 1","Kr. pr. måned",10225]
["Børnestøttebeløb, ikke optjent pensionsret","§ 27, stk. 2","Kr. pr. måned",3147]
["Enlige forsørgere – under 30 år (maksimum)","§ 12, stk. 3","Kr. pr. måned",12821]
["Fradrag ved formue og indtægt, beløb der ses bort fra"]
["Formue, enlige","§ 14, stk. 1","Kr. pr. måned",10000]
["Formue, ægtefæller","§ 14, stk. 1","Kr. pr. måned",20000]
["Formue, engangsbeløb fra forsikring ved kritisk sygdom","§ 14, stk. 8","Kr. pr. forsikringsbegivenhed",150000]
["Forsørgelsesydelse, ægtefæller, forsørgelsespligt","§ 30, stk. 2","Kr. pr. måned"]
[null,null,null,15547]
["Forsørgelsesydelse, ægtefæller, andre","§ 30, stk. 2","Kr. pr. måned",11698]
["Fradrag pr. arbejdstime ved arbejdsindtægt","§ 31, stk. 1","Kr. pr. time",28.4]
["Fradrag for indtægter ved arbejde - STU (maksimumbeløb)","§ 31, stk. 2","Kr. pr. år ",26842]
["Arbejdstillæg, ukendt arbejdstimer, omregningssats","§ 31, stk. 3","Kr. pr. time",247.53]
["Særlig støtte, grænsebeløb, boligudgift13)"]
["Ikke-forsørgere","§ 34, stk. 8","Kr. pr. måned",3150]
["Forsørgere med et hjemmeboende barn","§ 34, stk. 8","Kr. pr. måned",4600]
["Forsørgere med et udeboende barn","§ 34, stk. 8","Kr. pr. måned",4700]
["Fradrag i grænsebeløbet pr. barn hjemme udover 1","§ 34, stk. 8","Kr. pr. måned",850]
["Fradrag i grænsebeløbet pr. barn ude udover 1","§ 34, stk. 8","Kr. pr. måned",700]
["Indtægtsgrænse efter 3 måneder - dagpengemaksimum","§ 34, stk. 8","Kr. pr. måned",19322]
["Grænse uafhængig af tidligere indtægter – selvforsørgelses- og hjemrejseydelse og overgangsydelse","§ 34, stk. 8","Kr. pr. måned",14043]
["Fradrag for forskudsvis udlagt børnebidrag "]
["Samlede udbetalt beløb (minimumsbeløb)","§ 96 a, stk. 1","Kr. pr. måned",15547]

{"sheet":"2020 sats","index":9,"n_rows":206,"n_cols":13,"rows_kept":206,"cut":false,"hidden":false,"merged":[[205,0,205,15],[202,0,202,2],[202,3,202,8],[202,9,202,11],[202,12,202,14],[203,0,203,14],[204,0,204,14],[200,0,200,2],[200,3,200,8],[200,9,200,11],[200,12,200,14],[201,0,201,2],[201,3,201,8],[201,9,201,11],[201,12,201,14],[198,0,198,2],[198,3,198,8],[198,9,198,11],[198,12,198,14],[199,0,199,2],[199,3,199,8],[199,9,199,11],[199,12,199,14],[196,0,196,2],[196,3,196,8],[196,9,196,11],[196,12,196,14],[197,0,197,2],[197,3,197,8],[197,9,197,11],[197,12,197,14],[194,0,194,2],[194,3,194,8],[194,9,194,11],[194,12,194,14],[195,0,195,2],[195,3,195,8],[195,9,195,11],[195,12,195,14],[192,0,192,2],[192,3,192,8],[192,9,192,11],[192,12,192,14],[193,0,193,2],[193,3,193,8],[193,9,193,11],[193,12,193,14],[190,0,190,2],[190,3,190,8],[190,9,190,11],[190,12,190,14],[191,0,191,2],[191,3,191,8],[191,9,191,11],[191,12,191,14],[188,0,188,2],[188,3,188,8],[188,9,188,11],[188,12,188,14],[189,0,189,2],[189,3,189,8],[189,9,189,11],[189,12,189,14],[185,0,185,2],[185,3,185,8],[185,9,185,11],[185,12,185,14],[186,0,187,2],[186,3,187,8],[186,9,186,11],[187,9,187,11],[186,12,187,14],[183,0,183,2],[183,3,183,8],[183,9,183,11],[183,12,183,14],[184,0,184,2],[184,3,184,8],[184,9,184,11],[184,12,184,14],[181,0,181,2],[181,3,181,8],[181,9,181,11],[181,12,181,14],[182,0,182,2],[182,3,182,8],[182,9,182,11],[182,12,182,14],[179,0,179,2],[179,3,179,8],[179,9,179,11],[179,12,179,14],[180,0,180,2],[180,3,180,8],[180,9,180,11],[180,12,180,14],[177,0,177,2],[177,3,177,8],[177,9,177,11],[177,12,177,14],[178,0,178,2],[178,3,178,8],[178,9,178,11],[178,12,178,14],[175,0,175,2],[175,3,175,8],[175,9,175,11],[175,12,175,14],[176,0,176,2],[176,3,176,8],[176,9,176,11],[176,12,176,14],[173,0,173,2],[173,3,173,8],[173,9,173,11],[173,12,173,14],[174,0,174,2],[174,3,174,8],[174,9,174,11],[174,12,174,14],[171,0,171,2],[171,3,171,8],[171,9,171,11],[171,12,171,14],[172,0,172,2],[172,3,172,8],[172,9,172,11],[172,12,172,14],[169,0,169,2],[169,3,169,8],[169,9,169,11],[169,12,169,14],[170,0,170,2],[170,3,170,8],[170,9,170,11],[170,12,170,14],[167,0,167,2],[167,3,167,8],[167,9,167,11],[167,12,167,14],[168,0,168,2],[168,3,168,8],[168,9,168,11],[168,12,168,14],[165,0,165,2],[165,3,165,8],[165,9,165,11],[165,12,165,14],[166,0,166,2],[166,3,166,8],[166,9,166,11],[166,12,166,14],[163,0,163,2],[163,3,163,8],[163,9,163,11],[163,12,163,14],[164,0,164,2],[164,3,164,8],[164,9,164,11],[164,12,164,14],[161,0,161,2],[161,3,161,8],[161,9,161,11],[161,12,161,14],[162,0,162,2],[162,3,162,8],[162,9,162,11],[162,12,162,14],[159,0,159,2],[159,3,159,8],[159,9,159,11],[159,12,159,14],[160,0,160,2],[160,3,160,8],[160,9,160,11],[160,12,160,14],[157,0,157,2],[157,3,157,8],[157,9,157,11],[157,12,157,14],[158,0,158,2],[158,3,158,8],[158,9,158,11],[158,12,158,14],[155,0,155,2],[155,3,155,8],[155,9,155,11],[155,12,155,14],[156,0,156,2],[156,3,156,8],[156,9,156,11],[156,12,156,14],[153,0,153,2],[153,3,153,8],[153,9,153,11],[153,12,153,14],[154,0,154,2],[154,3,154,8],[154,9,154,11],[154,12,154,14],[151,0,151,2],[151,3,151,8],[151,9,151,11],[151,12,151,14],[152,0,152,2],[152,3,152,8],[152,9,152,11],[152,12,152,14],[149,0,149,2],[149,3,149,8],[149,9,149,11],[149,12,149,14],[150,0,150,2],[150,3,150,8],[150,9,150,11],[150,12,150,14],[147,0,147,2],[147,3,147,8],[147,9,147,11],[147,12,147,14],[148,0,148,2],[148,3,148,8],[148,9,148,11],[148,12,148,14],[145,0,145,2],[145,3,145,8],[145,9,145,11],[145,12,145,14],[146,0,146,2],[146,3,146,8],[146,9,146,11],[146,12,146,14],[143,0,143,2],[143,3,143,8],[143,9,143,11],[143,12,143,14],[144,0,144,2],[144,3,144,8],[144,9,144,11],[144,12,144,14],[141,0,141,2],[141,3,141,8],[141,9,141,11],[141,12,141,14],[142,0,142,2],[142,3,142,8],[142,9,142,11],[142,12,142,14],[139,0,139,2],[139,3,139,8],[139,9,139,11],[139,12,139,14],[140,0,140,2],[140,3,140,8],[140,9,140,11],[140,12,140,14],[137,0,137,2],[137,3,137,8],[137,9,137,11],[137,12,137,14],[138,0,138,2],[138,3,138,8],[138,9,138,11],[138,12,138,14],[135,0,135,2],[135,3,135,8],[135,9,135,11],[135,12,135,14],[136,0,136,2],[136,3,136,8],[136,9,136,11],[136,12,136,14],[133,0,133,2],[133,3,133,8],[133,9,133,11],[133,12,133,14],[134,0,134,2],[134,3,134,8],[134,9,134,11],[134,12,134,14],[131,0,131,2],[131,3,131,8],[131,9,131,11],[131,12,131,14],[132,0,132,2],[132,3,132,8],[132,9,132,11],[132,12,132,14],[129,0,129,2],[129,3,129,8],[129,9,129,11],[129,12,129,14],[130,0,130,2],[130,3,130,8],[130,9,130,11],[130,12,130,14],[127,0,127,2],[127,3,127,8],[127,9,127,11],[127,12,127,14],[128,0,128,2],[128,3,128,8],[128,9,128,11],[128,12,128,14],[125,0,125,2],[125,3,125,8],[125,9,125,11],[125,12,125,14],[126,0,126,2],[126,3,126,8],[126,9,126,11],[126,12,126,14],[123,0,123,2],[123,3,123,8],[123,9,123,11],[123,12,123,14],[124,0,124,2],[124,3,124,8],[124,9,124,11],[124,12,124,14],[121,0,121,2],[121,3,121,8],[121,9,121,11],[121,12,121,14],[122,0,122,2],[122,3,122,8],[122,9,122,11],[122,12,122,14],[119,0,119,2],[119,3,119,8],[119,9,119,11],[119,12,119,14],[120,0,120,2],[120,3,120,8],[120,9,120,11],[120,12,120,14],[117,0,117,2],[117,3,117,8],[117,9,117,11],[117,12,117,14],[118,0,118,2],[118,3,118,8],[118,9,118,11],[118,12,118,14],[115,0,115,2],[115,3,115,8],[115,9,115,11],[115,12,115,14],[116,0,116,2],[116,3,116,8],[116,9,116,11],[116,12,116,14],[113,0,113,2],[113,3,113,8],[113,9,113,11],[113,12,113,14],[114,0,114,2],[114,3,114,8],[114,9,114,11],[114,12,114,14],[111,0,111,2],[111,3,111,8],[111,9,111,11],[111,12,111,14],[112,0,112,2],[112,3,112,8],[112,9,112,11],[112,12,112,14],[109,0,109,2],[109,3,109,8],[109,9,109,11],[109,12,109,14],[110,0,110,2],[110,3,110,8],[110,9,110,11],[110,12,110,14],[107,0,107,2],[107,3,107,8],[107,9,107,11],[107,12,107,14],[108,0,108,2],[108,3,108,8],[108,9,108,11],[108,12,108,14],[105,0,105,2],[105,3,105,8],[105,9,105,11],[105,12,105,14],[106,0,106,2],[106,3,106,8],[106,9,106,11],[106,12,106,14],[103,0,103,2],[103,3,103,8],[103,9,103,11],[103,12,103,14],[104,0,104,2],[104,3,104,8],[104,9,104,11],[104,12,104,14],[101,0,101,2],[101,3,101,8],[101,9,101,11],[101,12,101,14],[102,0,102,2],[102,3,102,8],[102,9,102,11],[102,12,102,14],[99,0,99,2],[99,3,99,8],[99,9,99,11],[99,12,99,14],[100,0,100,2],[100,3,100,8],[100,9,100,11],[100,12,100,14],[97,0,97,2],[97,3,97,8],[97,9,97,11],[97,12,97,14],[98,0,98,2],[98,3,98,8],[98,9,98,11],[98,12,98,14],[95,0,95,2],[95,3,95,8],[95,9,95,11],[95,12,95,14],[96,0,96,2],[96,3,96,8],[96,9,96,11],[96,12,96,14],[93,0,93,2],[93,3,93,8],[93,9,93,11],[93,12,93,14],[94,0,94,2],[94,3,94,8],[94,9,94,11],[94,12,94,14],[91,0,91,2],[91,3,91,8],[91,9,91,11],[91,12,91,14],[92,0,92,2],[92,3,92,8],[92,9,92,11],[92,12,92,14],[89,0,89,2],[89,3,89,8],[89,9,89,11],[89,12,89,14],[90,0,90,2],[90,3,90,8],[90,9,90,11],[90,12,90,14],[87,0,87,2],[87,3,87,8],[87,9,87,11],[87,12,87,14],[88,0,88,2],[88,3,88,8],[88,9,88,11],[88,12,88,14],[85,0,85,2],[85,3,85,8],[85,9,85,11],[85,12,85,14],[86,0,86,2],[86,3,86,8],[86,9,86,11],[86,12,86,14],[83,0,83,2],[83,3,83,8],[83,9,83,11],[83,12,83,14],[84,0,84,2],[84,3,84,8],[84,9,84,11],[84,12,84,14],[81,0,81,2],[81,3,81,8],[81,9,81,11],[81,12,81,14],[82,0,82,2],[82,3,82,8],[82,9,82,11],[82,12,82,14],[79,0,79,2],[79,3,79,8],[79,9,79,11],[79,12,79,14],[80,0,80,2],[80,3,80,8],[80,9,80,11],[80,12,80,14],[77,0,77,2],[77,3,77,8],[77,9,77,11],[77,12,77,14],[78,0,78,2],[78,3,78,8],[78,9,78,11],[78,12,78,14],[75,0,75,2],[75,3,75,8],[75,9,75,11],[75,12,75,14],[76,0,76,2],[76,3,76,8],[76,9,76,11],[76,12,76,14],[73,0,73,2],[73,3,73,8],[73,9,73,11],[73,12,73,14],[74,0,74,2],[74,3,74,8],[74,9,74,11],[74,12,74,14],[71,0,71,2],[71,3,71,8],[71,9,71,11],[71,12,71,14],[72,0,72,2],[72,3,72,8],[72,9,72,11],[72,12,72,14],[68,0,68,2],[68,3,68,8],[68,9,68,11],[68,12,68,14],[69,0,70,2],[69,3,69,8],[70,3,70,8],[69,9,70,11],[69,12,70,14],[66,0,66,2],[66,3,66,8],[66,9,66,11],[66,12,66,14],[67,0,67,2],[67,3,67,8],[67,9,67,11],[67,12,67,14],[64,0,64,2],[64,3,64,8],[64,9,64,11],[64,12,64,14],[65,0,65,2],[65,3,65,8],[65,9,65,11],[65,12,65,14],[61,0,61,2],[61,3,61,8],[61,9,61,11],[61,12,61,14],[62,0,62,2],[63,0,63,2],[62,3,63,8],[62,9,63,11],[62,12,63,14],[59,0,59,2],[59,3,59,8],[59,9,59,11],[59,12,59,14],[60,0,60,2],[60,3,60,8],[60,9,60,11],[60,12,60,14],[56,0,56,2],[57,0,57,2],[56,3,57,8],[56,9,57,11],[56,12,57,14],[58,0,58,2],[58,3,58,8],[58,9,58,11],[58,12,58,14],[54,0,54,2],[54,3,54,8],[54,9,54,11],[54,12,54,14],[55,0,55,2],[55,3,55,8],[55,9,55,11],[55,12,55,14],[52,0,52,2],[52,3,52,8],[52,9,52,11],[52,12,52,14],[53,0,53,2],[53,3,53,8],[53,9,53,11],[53,12,53,14],[50,0,50,2],[50,3,50,8],[50,9,50,11],[50,12,50,14],[51,0,51,2],[51,3,51,8],[51,9,51,11],[51,12,51,14],[48,0,48,2],[48,3,48,8],[48,9,48,11],[48,12,48,14],[49,0,49,2],[49,3,49,8],[49,9,49,11],[49,12,49,14],[46,0,46,2],[46,3,46,8],[46,9,46,11],[46,12,46,14],[47,0,47,2],[47,3,47,8],[47,9,47,11],[47,12,47,14],[44,0,44,2],[44,3,44,8],[44,9,44,11],[44,12,44,14],[45,0,45,2],[45,3,45,8],[45,9,45,11],[45,12,45,14],[42,0,42,2],[42,3,42,8],[42,9,42,11],[42,12,42,14],[43,0,43,2],[43,3,43,8],[43,9,43,11],[43,12,43,14],[40,0,40,2],[40,3,40,8],[40,9,40,11],[40,12,40,14],[41,0,41,2],[41,3,41,8],[41,9,41,11],[41,12,41,14],[38,0,38,2],[38,3,38,8],[38,9,38,11],[38,12,38,14],[39,0,39,2],[39,3,39,8],[39,9,39,11],[39,12,39,14],[36,0,36,2],[36,3,36,8],[36,9,36,11],[36,12,36,14],[37,0,37,2],[37,3,37,8],[37,9,37,11],[37,12,37,14],[34,0,34,2],[34,3,34,8],[34,9,34,11],[34,12,34,14],[35,0,35,2],[35,3,35,8],[35,9,35,11],[35,12,35,14],[32,0,32,2],[32,3,32,8],[32,9,32,11],[32,12,32,14],[33,0,33,2],[33,3,33,8],[33,9,33,11],[33,12,33,14],[30,0,30,2],[30,3,30,8],[30,9,30,11],[30,12,30,14],[31,0,31,2],[31,3,31,8],[31,9,31,11],[31,12,31,14],[28,0,28,2],[28,3,28,8],[28,9,28,11],[28,12,28,14],[29,0,29,2],[29,3,29,8],[29,9,29,11],[29,12,29,14],[26,0,26,2],[26,3,26,8],[26,9,26,11],[26,12,26,14],[27,0,27,2],[27,3,27,8],[27,9,27,11],[27,12,27,14],[24,0,24,2],[24,3,24,8],[24,9,24,11],[24,12,24,14],[25,0,25,2],[25,3,25,8],[25,9,25,11],[25,12,25,14],[22,0,22,2],[22,3,22,8],[22,9,22,11],[22,12,22,14],[23,0,23,2],[23,3,23,8],[23,9,23,11],[23,12,23,14],[20,0,20,3],[20,4,20,14],[21,0,21,2],[21,3,21,8],[21,9,21,11],[21,12,21,14],[18,0,18,2],[18,3,18,8],[18,9,18,11],[18,12,18,14],[19,0,19,2],[19,3,19,8],[19,9,19,11],[19,12,19,14],[15,0,15,14],[16,0,16,2],[16,3,16,8],[16,9,16,11],[16,12,16,14],[17,0,17,2],[17,3,17,8],[17,9,17,11],[17,12,17,14],[13,0,13,2],[13,3,13,8],[13,9,13,11],[13,12,13,14],[14,0,14,2],[14,3,14,8],[14,9,14,11],[14,12,14,14],[11,0,11,2],[11,3,11,8],[11,9,11,11],[11,12,11,14],[12,0,12,2],[12,3,12,8],[12,9,12,11],[12,12,12,14],[9,0,9,2],[9,3,9,8],[9,9,9,11],[9,12,9,14],[10,0,10,2],[10,3,10,8],[10,9,10,11],[10,12,10,14],[7,0,7,2],[7,3,7,8],[7,9,7,11],[7,12,7,14],[8,0,8,2],[8,3,8,8],[8,9,8,11],[8,12,8,14],[6,0,6,2],[6,3,6,8],[6,9,6,11],[6,12,6,14],[3,0,3,2],[3,3,3,8],[3,9,3,11],[3,12,3,14],[4,0,4,2],[4,3,4,8],[4,9,4,11],[4,12,4,14],[0,0,0,14],[1,0,1,2],[1,3,1,8],[1,9,1,11],[1,12,1,14],[2,0,2,14],[5,0,5,2],[5,3,5,8],[5,9,5,11],[5,12,5,14]]}
["Tabel 5. Kontanthjælp og uddannelseshjælp, jf. lov om aktiv socialpolitik (LBK nr. 981 af 23. september 2019)"]
[null,null,null,"Lovhenvisning",null,null,null,null,null,"Enhed",null,null,"Sats"]
["Kontanthjælp"]
["Fyldt 30 år, forsørger børn",null,null,"§ 25, stk. 2, nr. 1",null,null,null,null,null,"Kr. pr. måned",null,null,15355]
["Fyldt 30 år, andre",null,null,"§ 25, stk. 2, nr. 2",null,null,null,null,null,"Kr. pr. måned",null,null,11554]
["Enlige forsørgere under 30 år",null,null,"§ 25, stk. 3, nr. 1",null,null,null,null,null,"Kr. pr. måned",null,null,14677]
["Forsørgere under 30 år, som ikke har erhvervet ret til ekstra børnetilskud",null,null,"§ 25, stk. 3, nr. 2",null,null,null,null,null,"Kr. pr. måned",null,null,10268]
["Under 30 år, gravid (passeret 12. svangerskabsuge)",null,null,"§ 25, stk. 3, nr. 3",null,null,null,null,null,"Kr. pr. måned",null,null,11554]
["Under 30 år, psykisk syg, forsørgelsespligt",null,null,"§ 25, stk. 3, nr. 4",null,null,null,null,null,"Kr. pr. måned",null,null,15355]
["Under 30 år, psykisk syg, udeboende",null,null,"§ 25, stk. 3, nr. 5",null,null,null,null,null,"Kr. pr. måned",null,null,11554]
["25-29 år, udeboende",null,null,"§ 25, stk. 3, nr. 6",null,null,null,null,null,"Kr. pr. måned",null,null,7448]
["25-29 år, hjemmeboende",null,null,"§ 25, stk. 3, nr. 7",null,null,null,null,null,"Kr. pr. måned",null,null,3594]
["Under 25 år, udeboende",null,null,"§ 25, stk. 3, nr. 8",null,null,null,null,null,"Kr. pr. måned",null,null,7448]
["Under 25 år, hjemmeboende",null,null,"§ 25, stk. 3, nr. 9",null,null,null,null,null,"Kr. pr. måned",null,null,3594]
["Under 30 år, bidragspligt, maksimum hjælp inkl. tillæg",null,null,"§ 25, stk. 4",null,null,null,null,null,"Kr. pr. måned",null,null,15355]
["Aktivitetstillæg/Barselstillæg til kontanthjælp"]
["Enlige forsørgere under 30 år",null,null,"§ 25, stk. 9, nr. 1",null,null,null,null,null,"Kr. pr. måned",null,null,678]
["Forsørgere under 30 år, som ikke har erhvervet ret til ekstra børnetilskud",null,null,"§ 25, stk. 9, nr. 2",null,null,null,null,null,"Kr. pr. måned",null,null,5087]
["25-29 år, udeboende",null,null,"§ 25, stk. 9, nr. 3",null,null,null,null,null,"Kr. pr. måned",null,null,4108]
["25-29 år, hjemmeboende",null,null,"§ 25, stk. 9, nr. 4",null,null,null,null,null,"Kr. pr. måned",null,null,7962]
["Periodesanktioner – fradrag i kontanthjælp 12)"]
["Fyldt 30 år, forsørger børn",null,null,"§ 35, stk. 3",null,null,null,null,null,"Kr. pr. dag",null,null,709]
["Fyldt 30 år, andre",null,null,"§ 35, stk. 3",null,null,null,null,null,"Kr. pr. dag",null,null,533]
["Enlige forsørgere under 30 år",null,null,"§ 35, stk. 3",null,null,null,null,null,"Kr. pr. dag",null,null,677]
["Forsørgere under 30 år, som ikke har erhvervet ret til ekstra børnetilskud",null,null,"§ 35, stk. 3",null,null,null,null,null,"Kr. pr. dag",null,null,474]
["Under 30 år, gravid (passeret 12. svangerskabsuge)",null,null,"§ 35, stk. 3",null,null,null,null,null,"Kr. pr. dag",null,null,533]
["Under 30 år, psykisk syg, forsørgelsespligt",null,null,"§ 35, stk. 3",null,null,null,null,null,"Kr. pr. dag",null,null,709]
["Under 30 år, psykisk syg, udeboende",null,null,"§ 35, stk. 3",null,null,null,null,null,"Kr. pr. dag",null,null,533]
["25-29 år, udeboende",null,null,"§ 35, stk. 3",null,null,null,null,null,"Kr. pr. dag",null,null,344]
["25-29 år, hjemmeboende",null,null,"§ 35, stk. 3",null,null,null,null,null,"Kr. pr. dag",null,null,166]
["Under 25 år, udeboende",null,null,"§ 35, stk. 3",null,null,null,null,null,"Kr. pr. dag",null,null,344]
["Under 25 år, hjemmeboende",null,null,"§ 35, stk. 3",null,null,null,null,null,"Kr. pr. dag",null,null,166]
["Under 30 år, bidragspligt, maksimum hjælp inkl. tillæg",null,null,"§ 35, stk. 3",null,null,null,null,null,"Kr. pr. dag",null,null,709]
["Periodesanktioner – fradrag i aktivitetstillæg til kontanthjælp 12)"]
["Enlige forsørgere under 30 år",null,null,"§ 35, stk. 3",null,null,null,null,null,"Kr. pr. dag",null,null,31]
["Forsørger under 30 år, som ikke har erhvervet ret til ekstra børnetilskud.",null,null,"§ 35, stk. 3",null,null,null,null,null,"Kr. pr. dag",null,null,235]
["25-29 år, udeboende",null,null,"§ 35, stk. 3",null,null,null,null,null,"Kr. pr. dag",null,null,190]
["25-29 år, hjemmeboende",null,null,"§ 35, stk. 3",null,null,null,null,null,"Kr. pr. dag",null,null,367]
["Punktsanktioner – nedsættelse af kontanthjælp 12)"]
["Fyldt 30 år, forsørger børn",null,null,"§ 40, stk. 1",null,null,null,null,null,"Kr. pr. hændelse",null,null,2127]
["Fyldt 30 år, andre",null,null,"§ 40, stk. 1",null,null,null,null,null,"Kr. pr. hændelse",null,null,1599]
["Enlige forsørgere under 30 år",null,null,"§ 40, stk. 1",null,null,null,null,null,"Kr. pr. hændelse",null,null,2031]
["Forsørgere under 30 år, som ikke har erhvervet ret til ekstra børnetilskud.",null,null,"§ 40, stk. 1",null,null,null,null,null,"Kr. pr. hændelse",null,null,1422]
["Under 30 år, gravid (passeret 12. svangerskabsuge)",null,null,"§ 40, stk. 1",null,null,null,null,null,"Kr. pr. hændelse",null,null,1599]
["Under 30 år, psykisk syg, forsørgelsespligt",null,null,"§ 40, stk. 1",null,null,null,null,null,"Kr. pr. hændelse",null,null,2127]
["Under 30 år, psykisk syg, udeboende",null,null,"§ 40, stk. 1",null,null,null,null,null,"Kr. pr. hændelse",null,null,1599]
["25-29 år, udeboende",null,null,"§ 40, stk. 1",null,null,null,null,null,"Kr. pr. hændelse",null,null,1032]
["25-29 år, hjemmeboende",null,null,"§ 40, stk. 1",null,null,null,null,null,"Kr. pr. hændelse",null,null,498]
["Under 25 år, udeboende",null,null,"§ 40, stk. 1",null,null,null,null,null,"Kr. pr. hændelse",null,null,1032]
["Under 25 år, hjemmeboende",null,null,"§ 40, stk. 1",null,null,null,null,null,"Kr. pr. hændelse",null,null,498]
["Under 30 år, bidragspligt, maksimum hjælp inkl. tillæg",null,null,"§ 40, stk. 1",null,null,null,null,null,"Kr. pr. hændelse",null,null,2127]
["Punktsanktioner – nedsættelse i aktivitetstillæg til kontanthjælp 12)"]
["Enlige forsørgere under 30 år",null,null,"§ 40, stk. 1",null,null,null,null,null,"Kr. pr. hændelse",null,null,93]
["Forsørgere under 30 år, som ikke har erhvervet ret til ekstra børnetilskud",null,null,"§ 40, stk. 1",null,null,null,null,null,"Kr. pr. hændelse",null,null,705]
["25-29 år, udeboende",null,null,"§ 40, stk. 1",null,null,null,null,null,"Kr. pr. hændelse",null,null,570]
["25-29 år, hjemmeboende",null,null,"§ 40, stk. 1",null,null,null,null,null,"Kr. pr. hændelse",null,null,1101]
["Sanktionssatser – kontanthjælp. § 35, stk. 413)",null,null,"§ 35, stk. 4",null,null,null,null,null,"Kr. pr. måned",null,null,200]
["Sanktionssats ved en månedlig ydelsessats under 5.550 kr."]
["Sanktionssats ved en månedlig ydelsessats 5.550-9.800 kr.",null,null,"§ 35, stk. 4",null,null,null,null,null,"Kr. pr. måned",null,null,400]
["Sanktionssats ved en månedlig ydelsessats 9.801-13.350 kr.",null,null,"§ 35, stk. 4",null,null,null,null,null,"Kr. pr. måned",null,null,600]
["Sanktionssats ved en månedlig ydelsessats over 13.350 kr.",null,null,"§ 35, stk. 4",null,null,null,null,null,"Kr. pr. måned",null,null,700]
[]
["Sanktionssatser – kontanthjælp. § 35, stk. 513)",null,null,"§ 35, stk. 5",null,null,null,null,null,"Kr. pr. måned",null,null,600]
["Sanktionssats ved en månedlig ydelsessats under 5.550 kr."]
["Sanktionssats ved en månedlig ydelsessats 5.550-9.800 kr.",null,null,"§ 35, stk. 5",null,null,null,null,null,"Kr. pr. måned",null,null,1200]
["Sanktionssats ved en månedlig ydelsessats 9.801-13.350 kr.",null,null,"§ 35, stk. 5",null,null,null,null,null,"Kr. pr. måned",null,null,1800]
["Sanktionssats ved en månedlig ydelsessats over 13.350 kr.",null,null,"§ 35, stk. 5",null,null,null,null,null,"Kr. pr. måned",null,null,2100]
[]
["Sanktion ved uberettiget modtagelse af hjælp efter §§ 22-25 samtidig med arbejde eller ophold i udlandet"]
["Sanktionsgrænse",null,null,"§ 42, stk. 1 og § 43,",null,null,null,null,null,"Kr. pr. måned",null,null,11554]
[null,null,null,"stk. 1"]
[]
["Uddannelseshjælp"]
["Enlige forsørgere under 30 år",null,null,"§ 23, stk. 2, nr. 1",null,null,null,null,null,"Kr. pr. måned",null,null,12663]
["Forsørgere under 30 år, som ikke har erhvervet ret til ekstra børnetilskud",null,null,"§ 23, stk. 2, nr. 2",null,null,null,null,null,"Kr. pr. måned",null,null,8862]
["Under 30 år, gravid (passeret 12. svangerskabsuge)",null,null,"§ 23, stk. 2, nr. 3",null,null,null,null,null,"Kr. pr. måned",null,null,11554]
["Under 30 år, psykisk syg, forsørgelsespligt",null,null,"§ 23, stk. 2, nr. 4",null,null,null,null,null,"Kr. pr. måned",null,null,15355]
["Under 30 år, psykisk syg, udeboende",null,null,"§ 23, stk. 2, nr. 5",null,null,null,null,null,"Kr. pr. måned",null,null,11554]
["25-29 år, udeboende",null,null,"§ 23, stk. 2, nr. 6",null,null,null,null,null,"Kr. pr. måned",null,null,6331]
["25-29 år, hjemmeboende",null,null,"§ 23, stk. 2, nr. 7",null,null,null,null,null,"Kr. pr. måned",null,null,2728]
["Under 25 år, udeboende",null,null,"§ 23, stk. 2, nr. 8",null,null,null,null,null,"Kr. pr. måned",null,null,6331]
["Under 25 år, hjemmeboende",null,null,"§ 23, stk. 2, nr. 9",null,null,null,null,null,"Kr. pr. måned",null,null,2728]
["Under 30 år, bidragspligt, maksimum hjælp inkl. tillæg",null,null,"§ 23, stk. 3",null,null,null,null,null,"Kr. pr. måned",null,null,15355]
["Aktivitetstillæg/Barselstillæg til uddannelseshjælp"]
["Enlige forsørgere under 30 år",null,null,"§ 24, stk. 3, nr. 1",null,null,null,null,null,"Kr. pr. måned",null,null,2693]
["Forsørgere under 30 år, som ikke har erhvervet ret til ekstra børnetilskud.",null,null,"§ 24, stk. 3, nr. 2",null,null,null,null,null,"Kr. pr. måned",null,null,6494]
["25-29 år, udeboende",null,null,"§ 24, stk. 3, nr. 3",null,null,null,null,null,"Kr. pr. måned",null,null,5223]
["25-29 år, hjemmeboende",null,null,"§ 24, stk. 3, nr. 4",null,null,null,null,null,"Kr. pr. måned",null,null,8826]
["Under 25 år, udeboende",null,null,"§ 24, stk. 3, nr. 5",null,null,null,null,null,"Kr. pr. måned",null,null,1116]
["Under 25 år, hjemmeboende",null,null,"§ 24, stk. 3, nr. 6",null,null,null,null,null,"Kr. pr. måned",null,null,865]
["Periodesanktioner – fradrag i uddannelseshjælp 12)"]
["Enlige forsørgere under 30 år",null,null,"§ 35, stk. 3",null,null,null,null,null,"Kr. pr. dag",null,null,584]
["Forsørgere under 30 år, som ikke har erhvervet ret til ekstra børnetilskud",null,null,"§ 35, stk. 3",null,null,null,null,null,"Kr. pr. dag",null,null,409]
["Under 30 år, gravid (passeret 12. svangerskabsuge)",null,null,"§ 35, stk. 3",null,null,null,null,null,"Kr. pr. dag",null,null,533]
["Under 30 år, psykisk syg, forsørgelsespligt",null,null,"§ 35, stk. 3",null,null,null,null,null,"Kr. pr. dag",null,null,709]
["Under 30 år, psykisk syg, udeboende",null,null,"§ 35, stk. 3",null,null,null,null,null,"Kr. pr. dag",null,null,533]
["25-29 år, udeboende",null,null,"§ 35, stk. 3",null,null,null,null,null,"Kr. pr. dag",null,null,292]
["25-29 år, hjemmeboende",null,null,"§ 35, stk. 3",null,null,null,null,null,"Kr. pr. dag",null,null,126]
["Under 25 år, udeboende",null,null,"§ 35, stk. 3",null,null,null,null,null,"Kr. pr. dag",null,null,292]
["Under 25 år, hjemmeboende",null,null,"§ 35, stk. 3",null,null,null,null,null,"Kr. pr. dag",null,null,126]
["Under 30 år, bidragspligt, maksimum hjælp inkl. tillæg",null,null,"§ 35, stk. 3",null,null,null,null,null,"Kr. pr. dag",null,null,709]
["Periodesanktioner – fradrag i aktivitetstillæg til uddannelseshjælp 12)"]
["Enlige forsørgere under 30 år",null,null,"§ 35, stk. 3",null,null,null,null,null,"Kr. pr. dag",null,null,124]
["Forsørgere under 30 år, som ikke har erhvervet ret til ekstra børnetilskud",null,null,"§ 35, stk. 3",null,null,null,null,null,"Kr. pr. dag",null,null,300]
["25-29 år, udeboende",null,null,"§ 35, stk. 3",null,null,null,null,null,"Kr. pr. dag",null,null,241]
["25-29 år, hjemmeboende",null,null,"§ 35, stk. 3",null,null,null,null,null,"Kr. pr. dag",null,null,407]
["Under 25 år, udeboende",null,null,"§ 35, stk. 3",null,null,null,null,null,"Kr. pr. dag",null,null,52]
["Under 25 år, hjemmeboende",null,null,"§ 35, stk. 3",null,null,null,null,null,"Kr. pr. dag",null,null,40]
["Punktsanktioner – nedsættelse af uddannelseshjælp 12)"]
["Enlige forsørgere under 30 år",null,null,"§ 40, stk. 1",null,null,null,null,null,"Kr. pr. hændelse",null,null,1752]
["Forsørgere under 30 år, som ikke har erhvervet ret til ekstra børnetilskud",null,null,"§ 40, stk. 1",null,null,null,null,null,"Kr. pr. hændelse",null,null,1227]
["Under 30 år, gravid (passeret 12. svangerskabsuge)",null,null,"§ 40, stk. 1",null,null,null,null,null,"Kr. pr. hændelse",null,null,1599]
["Under 30 år, psykisk syg, forsørgelsespligt",null,null,"§ 40, stk. 1",null,null,null,null,null,"Kr. pr. hændelse",null,null,2127]
["Under 30 år, psykisk syg, udeboende",null,null,"§ 40, stk. 1",null,null,null,null,null,"Kr. pr. hændelse",null,null,1599]
["25-29 år, udeboende",null,null,"§ 40, stk. 1",null,null,null,null,null,"Kr. pr. hændelse",null,null,876]
["25-29 år, hjemmeboende",null,null,"§ 40, stk. 1",null,null,null,null,null,"Kr. pr. hændelse",null,null,378]
["Under 25 år, udeboende",null,null,"§ 40, stk. 1",null,null,null,null,null,"Kr. pr. hændelse",null,null,876]
["Under 25 år, hjemmeboende",null,null,"§ 40, stk. 1",null,null,null,null,null,"Kr. pr. hændelse",null,null,378]
["Under 30 år, bidragspligt, maksimum hjælp inkl. tillæg",null,null,"§ 40, stk. 1",null,null,null,null,null,"Kr. pr. hændelse",null,null,2127]
["Punktsanktioner – nedsættelse af aktivitetstillæg til uddannelseshjælp 12)"]
["Enlige forsørgere under 30 år",null,null,"§ 40, stk. 1",null,null,null,null,null,"Kr. pr. hændelse",null,null,372]
["Forsørgere under 30 år, som ikke har erhvervet ret til ekstra børnetilskud",null,null,"§ 40, stk. 1",null,null,null,null,null,"Kr. pr. hændelse",null,null,900]
["25-29 år, udeboende",null,null,"§ 40, stk. 1",null,null,null,null,null,"Kr. pr. hændelse",null,null,723]
["25-29 år, hjemmeboende",null,null,"§ 40, stk. 1",null,null,null,null,null,"Kr. pr. hændelse",null,null,1221]
["Under 25 år, udeboende",null,null,"§ 40, stk. 1",null,null,null,null,null,"Kr. pr. hændelse",null,null,156]
["Under 25 år, hjemmeboende",null,null,"§ 40, stk. 1",null,null,null,null,null,"Kr. pr. hændelse",null,null,120]
[]
["Sanktionssatser – uddannelseshjælp. § 35, stk. 413)"]
["Sanktionssats ved en månedlig ydelsessats under 5.550 kr.",null,null,"§ 35, stk. 4",null,null,null,null,null,"Kr. pr. måned",null,null,200]
["Sanktionssats ved en månedlig ydelsessats 5.550-9.800 kr.",null,null,"§ 35, stk. 4",null,null,null,null,null,"Kr. pr. måned",null,null,400]
["Sanktionssats ved en månedlig ydelsessats 9.801-13.350 kr.",null,null,"§ 35, stk. 4",null,null,null,null,null,"Kr. pr. måned",null,null,600]
["Sanktionssats ved en månedlig ydelsessats over 13.350 kr.",null,null,"§ 35, stk. 4",null,null,null,null,null,"Kr. pr. måned",null,null,700]
[]
["Sanktionssatser – uddannelseshjælp. § 35, stk. 513)"]
["Sanktionssats ved en månedlig ydelsessats under 5.550 kr.",null,null,"§ 35, stk. 5",null,null,null,null,null,"Kr. pr. måned",null,null,600]
["Sanktionssats ved en månedlig ydelsessats 5.550-9.800 kr.",null,null,"§ 35, stk. 5",null,null,null,null,null,"Kr. pr. måned",null,null,1200]
["Sanktionssats ved en månedlig ydelsessats 9.801-13.350 kr.",null,null,"§ 35, stk. 5",null,null,null,null,null,"Kr. pr. måned",null,null,1800]
["Sanktionssats ved en månedlig ydelsessats over 13.350 kr.",null,null,"§ 35, stk. 5",null,null,null,null,null,"Kr. pr. måned",null,null,2100]
[]
["Sanktion ved uberettiget modtagelse af hjælp efter §§ 22-25 samtidig med arbejde eller ophold i udlandet"]
["Sanktionsgrænse",null,null,"§ 42, stk. 1 og § 43, stk. 1",null,null,null,null,null,"Kr. pr. måned",null,null,11554]
["Kontanthjælpsloft for modtagere af hjælp efter §§ 23-25 med et beløb svarende til satserne i § 25, stk. 2"]
["Gifte/samlevende, forsørgere",null,null,"§ 25 b, stk. 1, nr. 1",null,null,null,null,null,"Kr. pr. måned",null,null,15355]
["Gifte/samlevende, ikke forsørgere",null,null,"§ 25 b, stk. 1, nr. 2",null,null,null,null,null,"Kr. pr. måned",null,null,11554]
["Enlige, forsørger, 1 barn",null,null,"§ 25 b, stk. 1, nr. 3",null,null,null,null,null,"Kr. pr. måned",null,null,16009]
["Enlige, forsørger, 2 eller flere børn",null,null,"§ 25 b, stk. 1, nr. 4",null,null,null,null,null,"Kr. pr. måned",null,null,16387]
["Enlige, ikke forsørger",null,null,"§ 25 b, stk. 1, nr. 5",null,null,null,null,null,"Kr. pr. måned",null,null,13975]
["Kontanthjælpsloft for modtagere af hjælp efter § 25, stk. 3, og som ikke er omfattet af § 25 b, stk. 1"]
["Gifte/samlevende, forsørgere, 1 barn",null,null,"§ 25 b, stk. 2, nr. 1",null,null,null,null,null,"Kr. pr. måned",null,null,13110]
["Gifte/samlevende, forsørgere, 2 eller flere børn",null,null,"§ 25 b, stk. 2, nr. 2",null,null,null,null,null,"Kr. pr. måned",null,null,12980]
["Gifte/samlevende, ikke forsørgere",null,null,"§ 25 b, stk. 2, nr. 3",null,null,null,null,null,"Kr. pr. måned",null,null,9958]
["Enlige, forsørger, 1 barn",null,null,"§ 25 b, stk. 2, nr. 4",null,null,null,null,null,"Kr. pr. måned",null,null,15693]
["Enlige, forsørger, 2 eller flere børn",null,null,"§ 25 b, stk. 2, nr. 5",null,null,null,null,null,"Kr. pr. måned",null,null,16071]
["Enlige, ikke forsørger",null,null,"§ 25 b, stk. 2, nr. 6",null,null,null,null,null,"Kr. pr. måned",null,null,10698]
["Kontanthjælpsloft for modtagere af hjælp efter §§ 23-24, eller som får beregnet hjælp efter § 26, stk. 2, og som ikke er omfattet af § 25 b, stk. 1"]
["Gifte/samlevende, forsørgere, 1 barn",null,null,"§ 25 b, stk. 3, nr. 1",null,null,null,null,null,"Kr. pr. måned",null,null,12503]
["Gifte/samlevende, forsørgere, 2 eller flere børn",null,null,"§ 25 b, stk. 3, nr. 2",null,null,null,null,null,"Kr. pr. måned",null,null,12334]
["Gifte/samlevende, ikke forsørgere",null,null,"§ 25 b, stk. 3, nr. 3",null,null,null,null,null,"Kr. pr. måned",null,null,9541]
["Enlige, forsørger, 1 barn",null,null,"§ 25 b, stk. 3, nr. 4",null,null,null,null,null,"Kr. pr. måned",null,null,14931]
["Enlige, forsørger, 2 eller flere børn",null,null,"§ 25 b, stk. 3, nr. 5",null,null,null,null,null,"Kr. pr. måned",null,null,15308]
["Enlige, ikke forsørger",null,null,"§ 25 b, stk. 3, nr. 6",null,null,null,null,null,"Kr. pr. måned",null,null,10276]
["Kontanthjælpsloft for ægtefæller, hvor en eller begge modtager selvforsørgelses- og hjemrejseydelse eller overgangsydelse, og som ikke opfylder 225 timers kravet (Ægtefæller omfattet af § 13 f, stk. 3 og 4)"]
["Ej nedsat hjælp, forsørger, 1 barn",null,null,"§ 25 b, stk. 5, nr. 1",null,null,null,null,null,"Kr. pr. måned",null,null,9308]
["Ej nedsat hjælp, forsørger, 2 eller flere børn",null,null,"§ 25 b, stk. 5, nr. 2",null,null,null,null,null,"Kr. pr. måned",null,null,9378]
["Ej nedsat hjælp, ikke forsørger",null,null,"§ 25 b, stk. 5, nr. 3",null,null,null,null,null,"Kr. pr. måned",null,null,6255]
["Nedsat hjælp, forsørger, 1 barn",null,null,"§ 25 b, stk. 5, nr. 4",null,null,null,null,null,"Kr. pr. måned",null,null,7499]
["Nedsat hjælp, forsørger, 2 eller flere børn",null,null,"§ 25 b, stk. 5, nr. 5",null,null,null,null,null,"Kr. pr. måned",null,null,7569]
["Nedsat hjælp, ikke forsørger",null,null,"§ 25 b, stk. 5, nr. 6",null,null,null,null,null,"Kr. pr. måned",null,null,5539]
["Nedsættelse af hjælpen til ugifte personer, der ikke opfylder kravet om 225 timers ordinært og ustøttet arbejde inden for de seneste 12 kalendermåneder"]
["Hjælp beregnet på baggrund af 15.180 kr./11.423 kr. pr. måned",null,null,"§ 13 g, stk. 1, nr. 1",null,null,null,null,null,"Kr. pr. måned",null,null,1054]
["Hjælp beregnet på baggrund af mindre end 15.180 kr./11.423 kr. pr. måned",null,null,"§ 13 g, stk. 1, nr. 2",null,null,null,null,null,"Kr. pr. måned",null,null,526]
["Omregningssats for ukendt arbejdstid til 225 timers-regel"]
["Omregningssats",null,null,"§ 13 f, stk. 15",null,null,null,null,null,"Kr. pr. time",null,null,125.46]
["Ægtefælleberegning – 225 timers-regel"]
["Forsørgere",null,null,"§ 26, stk. 5-8",null,null,null,null,null,"Kr. pr. måned",null,null,15355]
["Ikke-forsørgere",null,null,"§ 26, stk. 5-8",null,null,null,null,null,"Kr. pr. måned",null,null,11554]
["Engangshjælp"]
["Over 25 år, samt udeboende under 25 år (maksimum)",null,null,"§ 25 a, stk. 2",null,null,null,null,null,"Kr. pr. måned",null,null,6175]
["Hjemmeboende under 25 år (maksimum)",null,null,"§ 25 a, stk. 3",null,null,null,null,null,"Kr. pr. måned",null,null,3070]
["Hjælp til visse persongrupper"]
["Nået efterlønsalderen, ikke optjent pensionsret",null,null,"§ 27, stk. 1",null,null,null,null,null,"Kr. pr. måned",null,null,9995]
["Børnestøttebeløb, ikke optjent pensionsret",null,null,"§ 27, stk. 2",null,null,null,null,null,"Kr. pr. måned",null,null,3108]
["Enlige forsørgere – under 30 år (maksimum)",null,null,"§ 12, stk. 3",null,null,null,null,null,"Kr. pr. måned",null,null,12663]
["Fradrag ved formue og indtægt, beløb der ses bort fra"]
["Formue, enlige",null,null,"§ 14, stk. 1",null,null,null,null,null,"Kr. pr. måned",null,null,10000]
["Formue, ægtefæller",null,null,"§ 14, stk. 1",null,null,null,null,null,"Kr. pr. måned",null,null,20000]
["Formue, engangsbeløb fra forsikring ved kritisk sygdom",null,null,"§ 14, stk. 8",null,null,null,null,null,"Kr. pr. forsikringsbe-",null,null,150000]
[null,null,null,null,null,null,null,null,null,"givenhed"]
["Forsørgelsesydelse, ægtefæller, forsørgelsespligt",null,null,"§ 30, stk. 2",null,null,null,null,null,"Kr. pr. måned",null,null,15355]
["Forsørgelsesydelse, ægtefæller, andre",null,null,"§ 30, stk. 2",null,null,null,null,null,"Kr. pr. måned",null,null,11554]
["Fradrag pr. arbejdstime ved arbejdsindtægt",null,null,"§ 31, stk. 1",null,null,null,null,null,"Kr. pr. time",null,null,27.84]
["Fradrag for indtægter ved arbejde - STU (maksimumbeløb)",null,null,"§ 31, stk. 2",null,null,null,null,null,"Kr. pr. år",null,null,26316]
["Arbejdstillæg, ukendt arbejdstimer, omregningssats",null,null,"§ 31, stk. 3",null,null,null,null,null,"Kr. pr. time",null,null,247.53]
["Særlig støtte, grænsebeløb, boligudgift 14)"]
["Ikke-forsørgere",null,null,"§ 34, stk. 8",null,null,null,null,null,"Kr. pr. måned",null,null,3100]
["Forsørgere med et hjemmeboende barn",null,null,"§ 34, stk. 8",null,null,null,null,null,"Kr. pr. måned",null,null,4500]
["Forsørgere med et udeboende barn",null,null,"§ 34, stk. 8",null,null,null,null,null,"Kr. pr. måned",null,null,4600]
["Fradrag i grænsebeløbet pr. barn hjemme udover 1",null,null,"§ 34, stk. 8",null,null,null,null,null,"Kr. pr. måned",null,null,850]
["Fradrag i grænsebeløbet pr. barn ude udover 1",null,null,"§ 34, stk. 8",null,null,null,null,null,"Kr. pr. måned",null,null,700]
["Indtægtsgrænse efter 3 måneder - dagpengemaksimum",null,null,"§ 34, stk. 8",null,null,null,null,null,"Kr. pr. måned",null,null,19083]
["Grænse uafhængig af tidligere indtægter - integrationsydelse",null,null,"§ 34, stk. 8",null,null,null,null,null,"Kr. pr. måned",null,null,13767]
["Fradrag for forskudsvis udlagt børnebidrag"]
["Samlede udbetalt beløb (minimumsbeløb)",null,null,"§ 96 a, stk. 1",null,null,null,null,null,"Kr. pr. måned",null,null,15355]
["12) Periodesanktioner og punktsanktioner henviser til sanktionsbestemmelserne i §§ 35-41 i LBK nr. 981 af 23. september 2019 og vejledning nr. 10013 af 13. oktober 2016 om rådighed og sanktioner for personer, der ansøger om eller modtager integrationsydelse, uddannelseshjælp eller kontanthjælp."]
["13) Sanktionssatser henviser til sanktionsbestemmelserne i §§ 35-40 a i lov nr. 1558 af 27. december 2019"]
["14) Jf. BEK nr. 1605 af 18. december 2018 om særlig støtte efter § 34 i lov om aktiv socialpolitik."]

{"sheet":"2019 sats","index":10,"n_rows":207,"n_cols":13,"rows_kept":207,"cut":false,"hidden":false,"merged":[[0,1,0,2],[0,3,0,8],[0,9,0,11],[0,12,0,14],[1,0,1,14],[2,0,2,2],[2,3,2,8],[2,9,2,11],[2,12,2,14],[6,0,6,2],[6,3,6,8],[6,9,6,11],[6,12,6,14],[7,0,7,2],[7,3,7,8],[7,9,7,11],[7,12,7,14],[3,0,3,14],[4,0,4,2],[4,3,4,8],[4,9,4,11],[4,12,4,14],[5,0,5,2],[5,3,5,8],[5,9,5,11],[5,12,5,14],[10,0,10,2],[10,3,10,8],[10,9,10,11],[10,12,10,14],[11,0,11,2],[11,3,11,8],[11,9,11,11],[11,12,11,14],[8,0,8,2],[8,3,8,8],[8,9,8,11],[8,12,8,14],[9,0,9,2],[9,3,9,8],[9,9,9,11],[9,12,9,14],[14,0,14,2],[14,3,14,8],[14,9,14,11],[14,12,14,14],[15,0,15,2],[15,3,15,8],[15,9,15,11],[15,12,15,14],[12,0,12,2],[12,3,12,8],[12,9,12,11],[12,12,12,14],[13,0,13,2],[13,3,13,8],[13,9,13,11],[13,12,13,14],[19,0,19,2],[19,3,19,8],[19,9,19,11],[19,12,19,14],[20,0,20,2],[20,3,20,8],[20,9,20,11],[20,12,20,14],[16,0,16,14],[17,0,17,2],[17,3,17,8],[17,9,17,11],[17,12,17,14],[18,0,18,2],[18,3,18,8],[18,9,18,11],[18,12,18,14],[23,0,23,2],[23,3,23,8],[23,9,23,11],[23,12,23,14],[24,0,24,2],[24,3,24,8],[24,9,24,11],[24,12,24,14],[21,0,21,3],[21,4,21,14],[22,0,22,2],[22,3,22,8],[22,9,22,11],[22,12,22,14],[27,0,27,2],[27,3,27,8],[27,9,27,11],[27,12,27,14],[28,0,28,2],[28,3,28,8],[28,9,28,11],[28,12,28,14],[25,0,25,2],[25,3,25,8],[25,9,25,11],[25,12,25,14],[26,0,26,2],[26,3,26,8],[26,9,26,11],[26,12,26,14],[31,0,31,2],[31,3,31,8],[31,9,31,11],[31,12,31,14],[32,0,32,2],[32,3,32,8],[32,9,32,11],[32,12,32,14],[29,0,29,2],[29,3,29,8],[29,9,29,11],[29,12,29,14],[30,0,30,2],[30,3,30,8],[30,9,30,11],[30,12,30,14],[35,0,35,2],[35,3,35,8],[35,9,35,11],[35,12,35,14],[36,0,36,2],[36,3,36,8],[36,9,36,11],[36,12,36,14],[33,0,33,2],[33,3,33,8],[33,9,33,11],[33,12,33,14],[34,0,34,2],[34,3,34,8],[34,9,34,11],[34,12,34,14],[39,0,39,2],[39,3,39,8],[39,9,39,11],[39,12,39,14],[40,0,40,2],[40,3,40,8],[40,9,40,11],[40,12,40,14],[37,0,37,2],[37,3,37,8],[37,9,37,11],[37,12,37,14],[38,0,38,2],[38,3,38,8],[38,9,38,11],[38,12,38,14],[43,0,43,2],[43,3,43,8],[43,9,43,11],[43,12,43,14],[44,0,44,2],[44,3,44,8],[44,9,44,11],[44,12,44,14],[41,0,41,2],[41,3,41,8],[41,9,41,11],[41,12,41,14],[42,0,42,2],[42,3,42,8],[42,9,42,11],[42,12,42,14],[47,0,47,2],[47,3,47,8],[47,9,47,11],[47,12,47,14],[48,0,48,2],[48,3,48,8],[48,9,48,11],[48,12,48,14],[45,0,45,2],[45,3,45,8],[45,9,45,11],[45,12,45,14],[46,0,46,2],[46,3,46,8],[46,9,46,11],[46,12,46,14],[51,0,51,2],[51,3,51,8],[51,9,51,11],[51,12,51,14],[52,0,52,2],[52,3,52,8],[52,9,52,11],[52,12,52,14],[49,0,49,2],[49,3,49,8],[49,9,49,11],[49,12,49,14],[50,0,50,2],[50,3,50,8],[50,9,50,11],[50,12,50,14],[55,0,55,2],[55,3,55,8],[55,9,55,11],[55,12,55,14],[56,0,56,2],[56,3,56,8],[56,9,56,11],[56,12,56,14],[53,0,53,2],[53,3,53,8],[53,9,53,11],[53,12,53,14],[54,0,54,2],[54,3,54,8],[54,9,54,11],[54,12,54,14],[60,0,60,2],[60,3,60,8],[60,9,60,11],[60,12,60,14],[61,0,61,2],[61,3,61,8],[61,9,61,11],[61,12,61,14],[57,0,57,2],[58,0,58,2],[57,3,58,8],[57,9,58,11],[57,12,58,14],[59,0,59,2],[59,3,59,8],[59,9,59,11],[59,12,59,14],[62,0,62,2],[62,3,62,8],[62,9,62,11],[62,12,62,14],[63,0,63,2],[64,0,64,2],[63,3,64,8],[63,9,64,11],[63,12,64,14],[67,0,67,2],[67,3,67,8],[67,9,67,11],[67,12,67,14],[68,0,68,2],[68,3,68,8],[68,9,68,11],[68,12,68,14],[65,0,65,2],[65,3,65,8],[65,9,65,11],[65,12,65,14],[66,0,66,2],[66,3,66,8],[66,9,66,11],[66,12,66,14],[72,0,72,2],[72,3,72,8],[72,9,72,11],[72,12,72,14],[73,0,73,2],[73,3,73,8],[73,9,73,11],[73,12,73,14],[69,0,69,2],[69,3,69,8],[69,9,69,11],[69,12,69,14],[70,0,71,2],[70,3,70,8],[71,3,71,8],[70,9,71,11],[70,12,71,14],[76,0,76,2],[76,3,76,8],[76,9,76,11],[76,12,76,14],[77,0,77,2],[77,3,77,8],[77,9,77,11],[77,12,77,14],[74,0,74,2],[74,3,74,8],[74,9,74,11],[74,12,74,14],[75,0,75,2],[75,3,75,8],[75,9,75,11],[75,12,75,14],[80,0,80,2],[80,3,80,8],[80,9,80,11],[80,12,80,14],[81,0,81,2],[81,3,81,8],[81,9,81,11],[81,12,81,14],[78,0,78,2],[78,3,78,8],[78,9,78,11],[78,12,78,14],[79,0,79,2],[79,3,79,8],[79,9,79,11],[79,12,79,14],[84,0,84,2],[84,3,84,8],[84,9,84,11],[84,12,84,14],[85,0,85,2],[85,3,85,8],[85,9,85,11],[85,12,85,14],[82,0,82,2],[82,3,82,8],[82,9,82,11],[82,12,82,14],[83,0,83,2],[83,3,83,8],[83,9,83,11],[83,12,83,14],[88,0,88,2],[88,3,88,8],[88,9,88,11],[88,12,88,14],[89,0,89,2],[89,3,89,8],[89,9,89,11],[89,12,89,14],[86,0,86,2],[86,3,86,8],[86,9,86,11],[86,12,86,14],[87,0,87,2],[87,3,87,8],[87,9,87,11],[87,12,87,14],[92,0,92,2],[92,3,92,8],[92,9,92,11],[92,12,92,14],[93,0,93,2],[93,3,93,8],[93,9,93,11],[93,12,93,14],[90,0,90,2],[90,3,90,8],[90,9,90,11],[90,12,90,14],[91,0,91,2],[91,3,91,8],[91,9,91,11],[91,12,91,14],[96,0,96,2],[96,3,96,8],[96,9,96,11],[96,12,96,14],[97,0,97,2],[97,3,97,8],[97,9,97,11],[97,12,97,14],[94,0,94,2],[94,3,94,8],[94,9,94,11],[94,12,94,14],[95,0,95,2],[95,3,95,8],[95,9,95,11],[95,12,95,14],[100,0,100,2],[100,3,100,8],[100,9,100,11],[100,12,100,14],[101,0,101,2],[101,3,101,8],[101,9,101,11],[101,12,101,14],[98,0,98,2],[98,3,98,8],[98,9,98,11],[98,12,98,14],[99,0,99,2],[99,3,99,8],[99,9,99,11],[99,12,99,14],[104,0,104,2],[104,3,104,8],[104,9,104,11],[104,12,104,14],[105,0,105,2],[105,3,105,8],[105,9,105,11],[105,12,105,14],[102,0,102,2],[102,3,102,8],[102,9,102,11],[102,12,102,14],[103,0,103,2],[103,3,103,8],[103,9,103,11],[103,12,103,14],[108,0,108,2],[108,3,108,8],[108,9,108,11],[108,12,108,14],[109,0,109,2],[109,3,109,8],[109,9,109,11],[109,12,109,14],[106,0,106,2],[106,3,106,8],[106,9,106,11],[106,12,106,14],[107,0,107,2],[107,3,107,8],[107,9,107,11],[107,12,107,14],[112,0,112,2],[112,3,112,8],[112,9,112,11],[112,12,112,14],[113,0,113,2],[113,3,113,8],[113,9,113,11],[113,12,113,14],[110,0,110,2],[110,3,110,8],[110,9,110,11],[110,12,110,14],[111,0,111,2],[111,3,111,8],[111,9,111,11],[111,12,111,14],[116,0,116,2],[116,3,116,8],[116,9,116,11],[116,12,116,14],[117,0,117,2],[117,3,117,8],[117,9,117,11],[117,12,117,14],[114,0,114,2],[114,3,114,8],[114,9,114,11],[114,12,114,14],[115,0,115,2],[115,3,115,8],[115,9,115,11],[115,12,115,14],[120,0,120,2],[120,3,120,8],[120,9,120,11],[120,12,120,14],[121,0,121,2],[121,3,121,8],[121,9,121,11],[121,12,121,14],[118,0,118,2],[118,3,118,8],[118,9,118,11],[118,12,118,14],[119,0,119,2],[119,3,119,8],[119,9,119,11],[119,12,119,14],[124,0,124,2],[124,3,124,8],[124,9,124,11],[124,12,124,14],[125,0,125,2],[125,3,125,8],[125,9,125,11],[125,12,125,14],[122,0,122,2],[122,3,122,8],[122,9,122,11],[122,12,122,14],[123,0,123,2],[123,3,123,8],[123,9,123,11],[123,12,123,14],[128,0,128,2],[128,3,128,8],[128,9,128,11],[128,12,128,14],[129,0,129,2],[129,3,129,8],[129,9,129,11],[129,12,129,14],[126,0,126,2],[126,3,126,8],[126,9,126,11],[126,12,126,14],[127,0,127,2],[127,3,127,8],[127,9,127,11],[127,12,127,14],[132,0,132,2],[132,3,132,8],[132,9,132,11],[132,12,132,14],[133,0,133,2],[133,3,133,8],[133,9,133,11],[133,12,133,14],[130,0,130,2],[130,3,130,8],[130,9,130,11],[130,12,130,14],[131,0,131,2],[131,3,131,8],[131,9,131,11],[131,12,131,14],[136,0,136,2],[136,3,136,8],[136,9,136,11],[136,12,136,14],[137,0,137,2],[137,3,137,8],[137,9,137,11],[137,12,137,14],[134,0,134,2],[134,3,134,8],[134,9,134,11],[134,12,134,14],[135,0,135,2],[135,3,135,8],[135,9,135,11],[135,12,135,14],[140,0,140,2],[140,3,140,8],[140,9,140,11],[140,12,140,14],[141,0,141,2],[141,3,141,8],[141,9,141,11],[141,12,141,14],[138,0,138,2],[138,3,138,8],[138,9,138,11],[138,12,138,14],[139,0,139,2],[139,3,139,8],[139,9,139,11],[139,12,139,14],[144,0,144,2],[144,3,144,8],[144,9,144,11],[144,12,144,14],[145,0,145,2],[145,3,145,8],[145,9,145,11],[145,12,145,14],[142,0,142,2],[142,3,142,8],[142,9,142,11],[142,12,142,14],[143,0,143,2],[143,3,143,8],[143,9,143,11],[143,12,143,14],[148,0,148,2],[148,3,148,8],[148,9,148,11],[148,12,148,14],[149,0,149,2],[149,3,149,8],[149,9,149,11],[149,12,149,14],[146,0,146,2],[146,3,146,8],[146,9,146,11],[146,12,146,14],[147,0,147,2],[147,3,147,8],[147,9,147,11],[147,12,147,14],[152,0,152,2],[152,3,152,8],[152,9,152,11],[152,12,152,14],[153,0,153,2],[153,3,153,8],[153,9,153,11],[153,12,153,14],[150,0,150,2],[150,3,150,8],[150,9,150,11],[150,12,150,14],[151,0,151,2],[151,3,151,8],[151,9,151,11],[151,12,151,14],[156,0,156,2],[156,3,156,8],[156,9,156,11],[156,12,156,14],[157,0,157,2],[157,3,157,8],[157,9,157,11],[157,12,157,14],[154,0,154,2],[154,3,154,8],[154,9,154,11],[154,12,154,14],[155,0,155,2],[155,3,155,8],[155,9,155,11],[155,12,155,14],[160,0,160,2],[160,3,160,8],[160,9,160,11],[160,12,160,14],[161,0,161,2],[161,3,161,8],[161,9,161,11],[161,12,161,14],[158,0,158,2],[158,3,158,8],[158,9,158,11],[158,12,158,14],[159,0,159,2],[159,3,159,8],[159,9,159,11],[159,12,159,14],[164,0,164,2],[164,3,164,8],[164,9,164,11],[164,12,164,14],[165,0,165,2],[165,3,165,8],[165,9,165,11],[165,12,165,14],[162,0,162,2],[162,3,162,8],[162,9,162,11],[162,12,162,14],[163,0,163,2],[163,3,163,8],[163,9,163,11],[163,12,163,14],[168,0,168,2],[168,3,168,8],[168,9,168,11],[168,12,168,14],[169,0,169,2],[169,3,169,8],[169,9,169,11],[169,12,169,14],[166,0,166,2],[166,3,166,8],[166,9,166,11],[166,12,166,14],[167,0,167,2],[167,3,167,8],[167,9,167,11],[167,12,167,14],[172,0,172,2],[172,3,172,8],[172,9,172,11],[172,12,172,14],[173,0,173,2],[173,3,173,8],[173,9,173,11],[173,12,173,14],[170,0,170,2],[170,3,170,8],[170,9,170,11],[170,12,170,14],[171,0,171,2],[171,3,171,8],[171,9,171,11],[171,12,171,14],[176,0,176,2],[176,3,176,8],[176,9,176,11],[176,12,176,14],[177,0,177,2],[177,3,177,8],[177,9,177,11],[177,12,177,14],[174,0,174,2],[174,3,174,8],[174,9,174,11],[174,12,174,14],[175,0,175,2],[175,3,175,8],[175,9,175,11],[175,12,175,14],[180,0,180,2],[180,3,180,8],[180,9,180,11],[180,12,180,14],[181,0,181,2],[181,3,181,8],[181,9,181,11],[181,12,181,14],[178,0,178,2],[178,3,178,8],[178,9,178,11],[178,12,178,14],[179,0,179,2],[179,3,179,8],[179,9,179,11],[179,12,179,14],[184,0,184,2],[184,3,184,8],[184,9,184,11],[184,12,184,14],[185,0,185,2],[185,3,185,8],[185,9,185,11],[185,12,185,14],[182,0,182,2],[182,3,182,8],[182,9,182,11],[182,12,182,14],[183,0,183,2],[183,3,183,8],[183,9,183,11],[183,12,183,14],[186,0,186,2],[186,3,186,8],[186,9,186,11],[186,12,186,14],[187,0,188,2],[187,3,188,8],[187,9,187,11],[188,9,188,11],[187,12,188,14],[191,0,191,2],[191,3,191,8],[191,9,191,11],[191,12,191,14],[192,0,192,2],[192,3,192,8],[192,9,192,11],[192,12,192,14],[189,0,189,2],[189,3,189,8],[189,9,189,11],[189,12,189,14],[190,0,190,2],[190,3,190,8],[190,9,190,11],[190,12,190,14],[195,0,195,2],[195,3,195,8],[195,9,195,11],[195,12,195,14],[196,0,196,2],[196,3,196,8],[196,9,196,11],[196,12,196,14],[193,0,193,2],[193,3,193,8],[193,9,193,11],[193,12,193,14],[194,0,194,2],[194,3,194,8],[194,9,194,11],[194,12,194,14],[199,0,199,2],[199,3,199,8],[199,9,199,11],[199,12,199,14],[200,0,200,2],[200,3,200,8],[200,9,200,11],[200,12,200,14],[197,0,197,2],[197,3,197,8],[197,9,197,11],[197,12,197,14],[198,0,198,2],[198,3,198,8],[198,9,198,11],[198,12,198,14],[206,0,206,15],[207,0,207,15],[203,0,203,2],[203,3,203,8],[203,9,203,11],[203,12,203,14],[204,0,204,14],[205,0,205,14],[201,0,201,2],[201,3,201,8],[201,9,201,11],[201,12,201,14],[202,0,202,2],[202,3,202,8],[202,9,202,11],[202,12,202,14]]}
[]
["Tabel 5. Kontanthjælp og uddannelseshjælp, jf. lov om aktiv socialpolitik (LBK nr. 981 af 23. september 2019)"]
[null,null,null,"Lovhenvisning",null,null,null,null,null,"Enhed",null,null,"Sats"]
["Kontanthjælp"]
["Fyldt 30 år, forsørger børn",null,null,"§ 25, stk. 2, nr. 1",null,null,null,null,null,"Kr. pr. måned",null,null,15355]
["Fyldt 30 år, andre",null,null,"§ 25, stk. 2, nr. 2",null,null,null,null,null,"Kr. pr. måned",null,null,11554]
["Enlige forsørgere under 30 år",null,null,"§ 25, stk. 3, nr. 1",null,null,null,null,null,"Kr. pr. måned",null,null,14677]
["Forsørgere under 30 år, som ikke har erhvervet ret til ekstra børnetilskud",null,null,"§ 25, stk. 3, nr. 2",null,null,null,null,null,"Kr. pr. måned",null,null,10268]
["Under 30 år, gravid (passeret 12. svangerskabsuge)",null,null,"§ 25, stk. 3, nr. 3",null,null,null,null,null,"Kr. pr. måned",null,null,11554]
["Under 30 år, psykisk syg, forsørgelsespligt",null,null,"§ 25, stk. 3, nr. 4",null,null,null,null,null,"Kr. pr. måned",null,null,15355]
["Under 30 år, psykisk syg, udeboende",null,null,"§ 25, stk. 3, nr. 5",null,null,null,null,null,"Kr. pr. måned",null,null,11554]
["25-29 år, udeboende",null,null,"§ 25, stk. 3, nr. 6",null,null,null,null,null,"Kr. pr. måned",null,null,7448]
["25-29 år, hjemmeboende",null,null,"§ 25, stk. 3, nr. 7",null,null,null,null,null,"Kr. pr. måned",null,null,3594]
["Under 25 år, udeboende",null,null,"§ 25, stk. 3, nr. 8",null,null,null,null,null,"Kr. pr. måned",null,null,7448]
["Under 25 år, hjemmeboende",null,null,"§ 25, stk. 3, nr. 9",null,null,null,null,null,"Kr. pr. måned",null,null,3594]
["Under 30 år, bidragspligt, maksimum hjælp inkl. tillæg",null,null,"§ 25, stk. 4",null,null,null,null,null,"Kr. pr. måned",null,null,15355]
["Aktivitetstillæg/Barselstillæg til kontanthjælp"]
["Enlige forsørgere under 30 år",null,null,"§ 25, stk. 9, nr. 1",null,null,null,null,null,"Kr. pr. måned",null,null,678]
["Forsørgere under 30 år, som ikke har erhvervet ret til ekstra børnetilskud",null,null,"§ 25, stk. 9, nr. 2",null,null,null,null,null,"Kr. pr. måned",null,null,5087]
["25-29 år, udeboende",null,null,"§ 25, stk. 9, nr. 3",null,null,null,null,null,"Kr. pr. måned",null,null,4108]
["25-29 år, hjemmeboende",null,null,"§ 25, stk. 9, nr. 4",null,null,null,null,null,"Kr. pr. måned",null,null,7962]
["Periodesanktioner – fradrag i kontanthjælp 12)"]
["Fyldt 30 år, forsørger børn",null,null,"§ 35, stk. 3",null,null,null,null,null,"Kr. pr. dag",null,null,709]
["Fyldt 30 år, andre",null,null,"§ 35, stk. 3",null,null,null,null,null,"Kr. pr. dag",null,null,533]
["Enlige forsørgere under 30 år",null,null,"§ 35, stk. 3",null,null,null,null,null,"Kr. pr. dag",null,null,677]
["Forsørgere under 30 år, som ikke har erhvervet ret til ekstra børnetilskud",null,null,"§ 35, stk. 3",null,null,null,null,null,"Kr. pr. dag",null,null,474]
["Under 30 år, gravid (passeret 12. svangerskabsuge)",null,null,"§ 35, stk. 3",null,null,null,null,null,"Kr. pr. dag",null,null,533]
["Under 30 år, psykisk syg, forsørgelsespligt",null,null,"§ 35, stk. 3",null,null,null,null,null,"Kr. pr. dag",null,null,709]
["Under 30 år, psykisk syg, udeboende",null,null,"§ 35, stk. 3",null,null,null,null,null,"Kr. pr. dag",null,null,533]
["25-29 år, udeboende",null,null,"§ 35, stk. 3",null,null,null,null,null,"Kr. pr. dag",null,null,344]
["25-29 år, hjemmeboende",null,null,"§ 35, stk. 3",null,null,null,null,null,"Kr. pr. dag",null,null,166]
["Under 25 år, udeboende",null,null,"§ 35, stk. 3",null,null,null,null,null,"Kr. pr. dag",null,null,344]
["Under 25 år, hjemmeboende",null,null,"§ 35, stk. 3",null,null,null,null,null,"Kr. pr. dag",null,null,166]
["Under 30 år, bidragspligt, maksimum hjælp inkl. tillæg",null,null,"§ 35, stk. 3",null,null,null,null,null,"Kr. pr. dag",null,null,709]
["Periodesanktioner – fradrag i aktivitetstillæg til kontanthjælp 12)"]
["Enlige forsørgere under 30 år",null,null,"§ 35, stk. 3",null,null,null,null,null,"Kr. pr. dag",null,null,31]
["Forsørger under 30 år, som ikke har erhvervet ret til ekstra børnetilskud.",null,null,"§ 35, stk. 3",null,null,null,null,null,"Kr. pr. dag",null,null,235]
["25-29 år, udeboende",null,null,"§ 35, stk. 3",null,null,null,null,null,"Kr. pr. dag",null,null,190]
["25-29 år, hjemmeboende",null,null,"§ 35, stk. 3",null,null,null,null,null,"Kr. pr. dag",null,null,367]
["Punktsanktioner – nedsættelse af kontanthjælp 12)"]
["Fyldt 30 år, forsørger børn",null,null,"§ 40, stk. 1",null,null,null,null,null,"Kr. pr. hændelse",null,null,2127]
["Fyldt 30 år, andre",null,null,"§ 40, stk. 1",null,null,null,null,null,"Kr. pr. hændelse",null,null,1599]
["Enlige forsørgere under 30 år",null,null,"§ 40, stk. 1",null,null,null,null,null,"Kr. pr. hændelse",null,null,2031]
["Forsørgere under 30 år, som ikke har erhvervet ret til ekstra børnetilskud.",null,null,"§ 40, stk. 1",null,null,null,null,null,"Kr. pr. hændelse",null,null,1422]
["Under 30 år, gravid (passeret 12. svangerskabsuge)",null,null,"§ 40, stk. 1",null,null,null,null,null,"Kr. pr. hændelse",null,null,1599]
["Under 30 år, psykisk syg, forsørgelsespligt",null,null,"§ 40, stk. 1",null,null,null,null,null,"Kr. pr. hændelse",null,null,2127]
["Under 30 år, psykisk syg, udeboende",null,null,"§ 40, stk. 1",null,null,null,null,null,"Kr. pr. hændelse",null,null,1599]
["25-29 år, udeboende",null,null,"§ 40, stk. 1",null,null,null,null,null,"Kr. pr. hændelse",null,null,1032]
["25-29 år, hjemmeboende",null,null,"§ 40, stk. 1",null,null,null,null,null,"Kr. pr. hændelse",null,null,498]
["Under 25 år, udeboende",null,null,"§ 40, stk. 1",null,null,null,null,null,"Kr. pr. hændelse",null,null,1032]
["Under 25 år, hjemmeboende",null,null,"§ 40, stk. 1",null,null,null,null,null,"Kr. pr. hændelse",null,null,498]
["Under 30 år, bidragspligt, maksimum hjælp inkl. tillæg",null,null,"§ 40, stk. 1",null,null,null,null,null,"Kr. pr. hændelse",null,null,2127]
["Punktsanktioner – nedsættelse i aktivitetstillæg til kontanthjælp 12)"]
["Enlige forsørgere under 30 år",null,null,"§ 40, stk. 1",null,null,null,null,null,"Kr. pr. hændelse",null,null,93]
["Forsørgere under 30 år, som ikke har erhvervet ret til ekstra børnetilskud",null,null,"§ 40, stk. 1",null,null,null,null,null,"Kr. pr. hændelse",null,null,705]
["25-29 år, udeboende",null,null,"§ 40, stk. 1",null,null,null,null,null,"Kr. pr. hændelse",null,null,570]
["25-29 år, hjemmeboende",null,null,"§ 40, stk. 1",null,null,null,null,null,"Kr. pr. hændelse",null,null,1101]
["Sanktionssatser – kontanthjælp. § 35, stk. 413)",null,null,"§ 35, stk. 4",null,null,null,null,null,"Kr. pr. måned",null,null,200]
["Sanktionssats ved en månedlig ydelsessats under 5.550 kr."]
["Sanktionssats ved en månedlig ydelsessats 5.550-9.800 kr.",null,null,"§ 35, stk. 4",null,null,null,null,null,"Kr. pr. måned",null,null,400]
["Sanktionssats ved en månedlig ydelsessats 9.801-13.350 kr.",null,null,"§ 35, stk. 4",null,null,null,null,null,"Kr. pr. måned",null,null,600]
["Sanktionssats ved en månedlig ydelsessats over 13.350 kr.",null,null,"§ 35, stk. 4",null,null,null,null,null,"Kr. pr. måned",null,null,700]
[]
["Sanktionssatser – kontanthjælp. § 35, stk. 513)",null,null,"§ 35, stk. 5",null,null,null,null,null,"Kr. pr. måned",null,null,600]
["Sanktionssats ved en månedlig ydelsessats under 5.550 kr."]
["Sanktionssats ved en månedlig ydelsessats 5.550-9.800 kr.",null,null,"§ 35, stk. 5",null,null,null,null,null,"Kr. pr. måned",null,null,1200]
["Sanktionssats ved en månedlig ydelsessats 9.801-13.350 kr.",null,null,"§ 35, stk. 5",null,null,null,null,null,"Kr. pr. måned",null,null,1800]
["Sanktionssats ved en månedlig ydelsessats over 13.350 kr.",null,null,"§ 35, stk. 5",null,null,null,null,null,"Kr. pr. måned",null,null,2100]
[]
["Sanktion ved uberettiget modtagelse af hjælp efter §§ 22-25 samtidig med arbejde eller ophold i udlandet"]
["Sanktionsgrænse",null,null,"§ 42, stk. 1 og § 43,",null,null,null,null,null,"Kr. pr. måned",null,null,11554]
[null,null,null,"stk. 1"]
[]
["Uddannelseshjælp"]
["Enlige forsørgere under 30 år",null,null,"§ 23, stk. 2, nr. 1",null,null,null,null,null,"Kr. pr. måned",null,null,12663]
["Forsørgere under 30 år, som ikke har erhvervet ret til ekstra børnetilskud",null,null,"§ 23, stk. 2, nr. 2",null,null,null,null,null,"Kr. pr. måned",null,null,8862]
["Under 30 år, gravid (passeret 12. svangerskabsuge)",null,null,"§ 23, stk. 2, nr. 3",null,null,null,null,null,"Kr. pr. måned",null,null,11554]
["Under 30 år, psykisk syg, forsørgelsespligt",null,null,"§ 23, stk. 2, nr. 4",null,null,null,null,null,"Kr. pr. måned",null,null,15355]
["Under 30 år, psykisk syg, udeboende",null,null,"§ 23, stk. 2, nr. 5",null,null,null,null,null,"Kr. pr. måned",null,null,11554]
["25-29 år, udeboende",null,null,"§ 23, stk. 2, nr. 6",null,null,null,null,null,"Kr. pr. måned",null,null,6331]
["25-29 år, hjemmeboende",null,null,"§ 23, stk. 2, nr. 7",null,null,null,null,null,"Kr. pr. måned",null,null,2728]
["Under 25 år, udeboende",null,null,"§ 23, stk. 2, nr. 8",null,null,null,null,null,"Kr. pr. måned",null,null,6331]
["Under 25 år, hjemmeboende",null,null,"§ 23, stk. 2, nr. 9",null,null,null,null,null,"Kr. pr. måned",null,null,2728]
["Under 30 år, bidragspligt, maksimum hjælp inkl. tillæg",null,null,"§ 23, stk. 3",null,null,null,null,null,"Kr. pr. måned",null,null,15355]
["Aktivitetstillæg/Barselstillæg til uddannelseshjælp"]
["Enlige forsørgere under 30 år",null,null,"§ 24, stk. 3, nr. 1",null,null,null,null,null,"Kr. pr. måned",null,null,2693]
["Forsørgere under 30 år, som ikke har erhvervet ret til ekstra børnetilskud.",null,null,"§ 24, stk. 3, nr. 2",null,null,null,null,null,"Kr. pr. måned",null,null,6494]
["25-29 år, udeboende",null,null,"§ 24, stk. 3, nr. 3",null,null,null,null,null,"Kr. pr. måned",null,null,5223]
["25-29 år, hjemmeboende",null,null,"§ 24, stk. 3, nr. 4",null,null,null,null,null,"Kr. pr. måned",null,null,8826]
["Under 25 år, udeboende",null,null,"§ 24, stk. 3, nr. 5",null,null,null,null,null,"Kr. pr. måned",null,null,1116]
["Under 25 år, hjemmeboende",null,null,"§ 24, stk. 3, nr. 6",null,null,null,null,null,"Kr. pr. måned",null,null,865]
["Periodesanktioner – fradrag i uddannelseshjælp 12)"]
["Enlige forsørgere under 30 år",null,null,"§ 35, stk. 3",null,null,null,null,null,"Kr. pr. dag",null,null,584]
["Forsørgere under 30 år, som ikke har erhvervet ret til ekstra børnetilskud",null,null,"§ 35, stk. 3",null,null,null,null,null,"Kr. pr. dag",null,null,409]
["Under 30 år, gravid (passeret 12. svangerskabsuge)",null,null,"§ 35, stk. 3",null,null,null,null,null,"Kr. pr. dag",null,null,533]
["Under 30 år, psykisk syg, forsørgelsespligt",null,null,"§ 35, stk. 3",null,null,null,null,null,"Kr. pr. dag",null,null,709]
["Under 30 år, psykisk syg, udeboende",null,null,"§ 35, stk. 3",null,null,null,null,null,"Kr. pr. dag",null,null,533]
["25-29 år, udeboende",null,null,"§ 35, stk. 3",null,null,null,null,null,"Kr. pr. dag",null,null,292]
["25-29 år, hjemmeboende",null,null,"§ 35, stk. 3",null,null,null,null,null,"Kr. pr. dag",null,null,126]
["Under 25 år, udeboende",null,null,"§ 35, stk. 3",null,null,null,null,null,"Kr. pr. dag",null,null,292]
["Under 25 år, hjemmeboende",null,null,"§ 35, stk. 3",null,null,null,null,null,"Kr. pr. dag",null,null,126]
["Under 30 år, bidragspligt, maksimum hjælp inkl. tillæg",null,null,"§ 35, stk. 3",null,null,null,null,null,"Kr. pr. dag",null,null,709]
["Periodesanktioner – fradrag i aktivitetstillæg til uddannelseshjælp 12)"]
["Enlige forsørgere under 30 år",null,null,"§ 35, stk. 3",null,null,null,null,null,"Kr. pr. dag",null,null,124]
["Forsørgere under 30 år, som ikke har erhvervet ret til ekstra børnetilskud",null,null,"§ 35, stk. 3",null,null,null,null,null,"Kr. pr. dag",null,null,300]
["25-29 år, udeboende",null,null,"§ 35, stk. 3",null,null,null,null,null,"Kr. pr. dag",null,null,241]
["25-29 år, hjemmeboende",null,null,"§ 35, stk. 3",null,null,null,null,null,"Kr. pr. dag",null,null,407]
["Under 25 år, udeboende",null,null,"§ 35, stk. 3",null,null,null,null,null,"Kr. pr. dag",null,null,52]
["Under 25 år, hjemmeboende",null,null,"§ 35, stk. 3",null,null,null,null,null,"Kr. pr. dag",null,null,40]
["Punktsanktioner – nedsættelse af uddannelseshjælp 12)"]
["Enlige forsørgere under 30 år",null,null,"§ 40, stk. 1",null,null,null,null,null,"Kr. pr. hændelse",null,null,1752]
["Forsørgere under 30 år, som ikke har erhvervet ret til ekstra børnetilskud",null,null,"§ 40, stk. 1",null,null,null,null,null,"Kr. pr. hændelse",null,null,1227]
["Under 30 år, gravid (passeret 12. svangerskabsuge)",null,null,"§ 40, stk. 1",null,null,null,null,null,"Kr. pr. hændelse",null,null,1599]
["Under 30 år, psykisk syg, forsørgelsespligt",null,null,"§ 40, stk. 1",null,null,null,null,null,"Kr. pr. hændelse",null,null,2127]
["Under 30 år, psykisk syg, udeboende",null,null,"§ 40, stk. 1",null,null,null,null,null,"Kr. pr. hændelse",null,null,1599]
["25-29 år, udeboende",null,null,"§ 40, stk. 1",null,null,null,null,null,"Kr. pr. hændelse",null,null,876]
["25-29 år, hjemmeboende",null,null,"§ 40, stk. 1",null,null,null,null,null,"Kr. pr. hændelse",null,null,378]
["Under 25 år, udeboende",null,null,"§ 40, stk. 1",null,null,null,null,null,"Kr. pr. hændelse",null,null,876]
["Under 25 år, hjemmeboende",null,null,"§ 40, stk. 1",null,null,null,null,null,"Kr. pr. hændelse",null,null,378]
["Under 30 år, bidragspligt, maksimum hjælp inkl. tillæg",null,null,"§ 40, stk. 1",null,null,null,null,null,"Kr. pr. hændelse",null,null,2127]
["Punktsanktioner – nedsættelse af aktivitetstillæg til uddannelseshjælp 12)"]
["Enlige forsørgere under 30 år",null,null,"§ 40, stk. 1",null,null,null,null,null,"Kr. pr. hændelse",null,null,372]
["Forsørgere under 30 år, som ikke har erhvervet ret til ekstra børnetilskud",null,null,"§ 40, stk. 1",null,null,null,null,null,"Kr. pr. hændelse",null,null,900]
["25-29 år, udeboende",null,null,"§ 40, stk. 1",null,null,null,null,null,"Kr. pr. hændelse",null,null,723]
["25-29 år, hjemmeboende",null,null,"§ 40, stk. 1",null,null,null,null,null,"Kr. pr. hændelse",null,null,1221]
["Under 25 år, udeboende",null,null,"§ 40, stk. 1",null,null,null,null,null,"Kr. pr. hændelse",null,null,156]
["Under 25 år, hjemmeboende",null,null,"§ 40, stk. 1",null,null,null,null,null,"Kr. pr. hændelse",null,null,120]
[]
["Sanktionssatser – uddannelseshjælp. § 35, stk. 413)"]
["Sanktionssats ved en månedlig ydelsessats under 5.550 kr.",null,null,"§ 35, stk. 4",null,null,null,null,null,"Kr. pr. måned",null,null,200]
["Sanktionssats ved en månedlig ydelsessats 5.550-9.800 kr.",null,null,"§ 35, stk. 4",null,null,null,null,null,"Kr. pr. måned",null,null,400]
["Sanktionssats ved en månedlig ydelsessats 9.801-13.350 kr.",null,null,"§ 35, stk. 4",null,null,null,null,null,"Kr. pr. måned",null,null,600]
["Sanktionssats ved en månedlig ydelsessats over 13.350 kr.",null,null,"§ 35, stk. 4",null,null,null,null,null,"Kr. pr. måned",null,null,700]
[]
["Sanktionssatser – uddannelseshjælp. § 35, stk. 513)"]
["Sanktionssats ved en månedlig ydelsessats under 5.550 kr.",null,null,"§ 35, stk. 5",null,null,null,null,null,"Kr. pr. måned",null,null,600]
["Sanktionssats ved en månedlig ydelsessats 5.550-9.800 kr.",null,null,"§ 35, stk. 5",null,null,null,null,null,"Kr. pr. måned",null,null,1200]
["Sanktionssats ved en månedlig ydelsessats 9.801-13.350 kr.",null,null,"§ 35, stk. 5",null,null,null,null,null,"Kr. pr. måned",null,null,1800]
["Sanktionssats ved en månedlig ydelsessats over 13.350 kr.",null,null,"§ 35, stk. 5",null,null,null,null,null,"Kr. pr. måned",null,null,2100]
[]
["Sanktion ved uberettiget modtagelse af hjælp efter §§ 22-25 samtidig med arbejde eller ophold i udlandet"]
["Sanktionsgrænse",null,null,"§ 42, stk. 1 og § 43, stk. 1",null,null,null,null,null,"Kr. pr. måned",null,null,11554]
["Kontanthjælpsloft for modtagere af hjælp efter §§ 23-25 med et beløb svarende til satserne i § 25, stk. 2"]
["Gifte/samlevende, forsørgere",null,null,"§ 25 b, stk. 1, nr. 1",null,null,null,null,null,"Kr. pr. måned",null,null,15355]
["Gifte/samlevende, ikke forsørgere",null,null,"§ 25 b, stk. 1, nr. 2",null,null,null,null,null,"Kr. pr. måned",null,null,11554]
["Enlige, forsørger, 1 barn",null,null,"§ 25 b, stk. 1, nr. 3",null,null,null,null,null,"Kr. pr. måned",null,null,16009]
["Enlige, forsørger, 2 eller flere børn",null,null,"§ 25 b, stk. 1, nr. 4",null,null,null,null,null,"Kr. pr. måned",null,null,16387]
["Enlige, ikke forsørger",null,null,"§ 25 b, stk. 1, nr. 5",null,null,null,null,null,"Kr. pr. måned",null,null,13975]
["Kontanthjælpsloft for modtagere af hjælp efter § 25, stk. 3, og som ikke er omfattet af § 25 b, stk. 1"]
["Gifte/samlevende, forsørgere, 1 barn",null,null,"§ 25 b, stk. 2, nr. 1",null,null,null,null,null,"Kr. pr. måned",null,null,13110]
["Gifte/samlevende, forsørgere, 2 eller flere børn",null,null,"§ 25 b, stk. 2, nr. 2",null,null,null,null,null,"Kr. pr. måned",null,null,12980]
["Gifte/samlevende, ikke forsørgere",null,null,"§ 25 b, stk. 2, nr. 3",null,null,null,null,null,"Kr. pr. måned",null,null,9958]
["Enlige, forsørger, 1 barn",null,null,"§ 25 b, stk. 2, nr. 4",null,null,null,null,null,"Kr. pr. måned",null,null,15693]
["Enlige, forsørger, 2 eller flere børn",null,null,"§ 25 b, stk. 2, nr. 5",null,null,null,null,null,"Kr. pr. måned",null,null,16071]
["Enlige, ikke forsørger",null,null,"§ 25 b, stk. 2, nr. 6",null,null,null,null,null,"Kr. pr. måned",null,null,10698]
["Kontanthjælpsloft for modtagere af hjælp efter §§ 23-24, eller som får beregnet hjælp efter § 26, stk. 2, og som ikke er omfattet af § 25 b, stk. 1"]
["Gifte/samlevende, forsørgere, 1 barn",null,null,"§ 25 b, stk. 3, nr. 1",null,null,null,null,null,"Kr. pr. måned",null,null,12503]
["Gifte/samlevende, forsørgere, 2 eller flere børn",null,null,"§ 25 b, stk. 3, nr. 2",null,null,null,null,null,"Kr. pr. måned",null,null,12334]
["Gifte/samlevende, ikke forsørgere",null,null,"§ 25 b, stk. 3, nr. 3",null,null,null,null,null,"Kr. pr. måned",null,null,9541]
["Enlige, forsørger, 1 barn",null,null,"§ 25 b, stk. 3, nr. 4",null,null,null,null,null,"Kr. pr. måned",null,null,14931]
["Enlige, forsørger, 2 eller flere børn",null,null,"§ 25 b, stk. 3, nr. 5",null,null,null,null,null,"Kr. pr. måned",null,null,15308]
["Enlige, ikke forsørger",null,null,"§ 25 b, stk. 3, nr. 6",null,null,null,null,null,"Kr. pr. måned",null,null,10276]
["Kontanthjælpsloft for ægtefæller, hvor en eller begge modtager selvforsørgelses- og hjemrejseydelse eller overgangsydelse, og som ikke opfylder 225 timers kravet (Ægtefæller omfattet af § 13 f, stk. 3 og 4)"]
["Ej nedsat hjælp, forsørger, 1 barn",null,null,"§ 25 b, stk. 5, nr. 1",null,null,null,null,null,"Kr. pr. måned",null,null,9308]
["Ej nedsat hjælp, forsørger, 2 eller flere børn",null,null,"§ 25 b, stk. 5, nr. 2",null,null,null,null,null,"Kr. pr. måned",null,null,9378]
["Ej nedsat hjælp, ikke forsørger",null,null,"§ 25 b, stk. 5, nr. 3",null,null,null,null,null,"Kr. pr. måned",null,null,6255]
["Nedsat hjælp, forsørger, 1 barn",null,null,"§ 25 b, stk. 5, nr. 4",null,null,null,null,null,"Kr. pr. måned",null,null,7499]
["Nedsat hjælp, forsørger, 2 eller flere børn",null,null,"§ 25 b, stk. 5, nr. 5",null,null,null,null,null,"Kr. pr. måned",null,null,7569]
["Nedsat hjælp, ikke forsørger",null,null,"§ 25 b, stk. 5, nr. 6",null,null,null,null,null,"Kr. pr. måned",null,null,5539]
["Nedsættelse af hjælpen til ugifte personer, der ikke opfylder kravet om 225 timers ordinært og ustøttet arbejde inden for de seneste 12 kalendermåneder"]
["Hjælp beregnet på baggrund af 15.180 kr./11.423 kr. pr. måned",null,null,"§ 13 g, stk. 1, nr. 1",null,null,null,null,null,"Kr. pr. måned",null,null,1054]
["Hjælp beregnet på baggrund af mindre end 15.180 kr./11.423 kr. pr. måned",null,null,"§ 13 g, stk. 1, nr. 2",null,null,null,null,null,"Kr. pr. måned",null,null,526]
["Omregningssats for ukendt arbejdstid til 225 timers-regel"]
["Omregningssats",null,null,"§ 13 f, stk. 15",null,null,null,null,null,"Kr. pr. time",null,null,125.46]
["Ægtefælleberegning – 225 timers-regel"]
["Forsørgere",null,null,"§ 26, stk. 5-8",null,null,null,null,null,"Kr. pr. måned",null,null,15355]
["Ikke-forsørgere",null,null,"§ 26, stk. 5-8",null,null,null,null,null,"Kr. pr. måned",null,null,11554]
["Engangshjælp"]
["Over 25 år, samt udeboende under 25 år (maksimum)",null,null,"§ 25 a, stk. 2",null,null,null,null,null,"Kr. pr. måned",null,null,6175]
["Hjemmeboende under 25 år (maksimum)",null,null,"§ 25 a, stk. 3",null,null,null,null,null,"Kr. pr. måned",null,null,3070]
["Hjælp til visse persongrupper"]
["Nået efterlønsalderen, ikke optjent pensionsret",null,null,"§ 27, stk. 1",null,null,null,null,null,"Kr. pr. måned",null,null,9995]
["Børnestøttebeløb, ikke optjent pensionsret",null,null,"§ 27, stk. 2",null,null,null,null,null,"Kr. pr. måned",null,null,3108]
["Enlige forsørgere – under 30 år (maksimum)",null,null,"§ 12, stk. 3",null,null,null,null,null,"Kr. pr. måned",null,null,12663]
["Fradrag ved formue og indtægt, beløb der ses bort fra"]
["Formue, enlige",null,null,"§ 14, stk. 1",null,null,null,null,null,"Kr. pr. måned",null,null,10000]
["Formue, ægtefæller",null,null,"§ 14, stk. 1",null,null,null,null,null,"Kr. pr. måned",null,null,20000]
["Formue, engangsbeløb fra forsikring ved kritisk sygdom",null,null,"§ 14, stk. 8",null,null,null,null,null,"Kr. pr. forsikringsbe-",null,null,150000]
[null,null,null,null,null,null,null,null,null,"givenhed"]
["Forsørgelsesydelse, ægtefæller, forsørgelsespligt",null,null,"§ 30, stk. 2",null,null,null,null,null,"Kr. pr. måned",null,null,15355]
["Forsørgelsesydelse, ægtefæller, andre",null,null,"§ 30, stk. 2",null,null,null,null,null,"Kr. pr. måned",null,null,11554]
["Fradrag pr. arbejdstime ved arbejdsindtægt",null,null,"§ 31, stk. 1",null,null,null,null,null,"Kr. pr. time",null,null,27.84]
["Fradrag for indtægter ved arbejde - STU (maksimumbeløb)",null,null,"§ 31, stk. 2",null,null,null,null,null,"Kr. pr. år",null,null,26316]
["Arbejdstillæg, ukendt arbejdstimer, omregningssats",null,null,"§ 31, stk. 3",null,null,null,null,null,"Kr. pr. time",null,null,247.53]
["Særlig støtte, grænsebeløb, boligudgift 14)"]
["Ikke-forsørgere",null,null,"§ 34, stk. 8",null,null,null,null,null,"Kr. pr. måned",null,null,3100]
["Forsørgere med et hjemmeboende barn",null,null,"§ 34, stk. 8",null,null,null,null,null,"Kr. pr. måned",null,null,4500]
["Forsørgere med et udeboende barn",null,null,"§ 34, stk. 8",null,null,null,null,null,"Kr. pr. måned",null,null,4600]
["Fradrag i grænsebeløbet pr. barn hjemme udover 1",null,null,"§ 34, stk. 8",null,null,null,null,null,"Kr. pr. måned",null,null,850]
["Fradrag i grænsebeløbet pr. barn ude udover 1",null,null,"§ 34, stk. 8",null,null,null,null,null,"Kr. pr. måned",null,null,700]
["Indtægtsgrænse efter 3 måneder - dagpengemaksimum",null,null,"§ 34, stk. 8",null,null,null,null,null,"Kr. pr. måned",null,null,19083]
["Grænse uafhængig af tidligere indtægter - integrationsydelse",null,null,"§ 34, stk. 8",null,null,null,null,null,"Kr. pr. måned",null,null,13767]
["Fradrag for forskudsvis udlagt børnebidrag"]
["Samlede udbetalt beløb (minimumsbeløb)",null,null,"§ 96 a, stk. 1",null,null,null,null,null,"Kr. pr. måned",null,null,15355]
["12) Periodesanktioner og punktsanktioner henviser til sanktionsbestemmelserne i §§ 35-41 i LBK nr. 981 af 23. september 2019 og vejledning nr. 10013 af 13. oktober 2016 om rådighed og sanktioner for personer, der ansøger om eller modtager integrationsydelse, uddannelseshjælp eller kontanthjælp."]
["13) Sanktionssatser henviser til sanktionsbestemmelserne i §§ 35-40 a i lov nr. 1558 af 27. december 2019"]
["14) Jf. BEK nr. 1605 af 18. december 2018 om særlig støtte efter § 34 i lov om aktiv socialpolitik."]

{"sheet":"2018-7 sats","index":11,"n_rows":178,"n_cols":10,"rows_kept":178,"cut":false,"hidden":false,"merged":[[0,0,0,11],[1,0,1,2],[1,3,1,6],[1,7,1,8],[1,9,1,11],[2,0,2,11],[5,0,5,2],[5,3,5,6],[5,7,5,8],[5,9,5,11],[6,0,6,2],[6,3,6,6],[6,7,6,8],[6,9,6,11],[3,0,3,2],[3,3,3,6],[3,7,3,8],[3,9,3,11],[4,0,4,2],[4,3,4,6],[4,7,4,8],[4,9,4,11],[9,0,9,2],[9,3,9,6],[9,7,9,8],[9,9,9,11],[10,0,10,2],[10,3,10,6],[10,7,10,8],[10,9,10,11],[7,0,7,2],[7,3,7,6],[7,7,7,8],[7,9,7,11],[8,0,8,2],[8,3,8,6],[8,7,8,8],[8,9,8,11],[13,0,13,2],[13,3,13,6],[13,7,13,8],[13,9,13,11],[14,0,14,2],[14,3,14,6],[14,7,14,8],[14,9,14,11],[11,0,11,2],[11,3,11,6],[11,7,11,8],[11,9,11,11],[12,0,12,2],[12,3,12,6],[12,7,12,8],[12,9,12,11],[18,0,18,2],[18,3,18,6],[18,7,18,8],[18,9,18,11],[19,0,19,2],[19,3,19,6],[19,7,19,8],[19,9,19,11],[15,0,15,11],[16,0,16,2],[16,3,16,6],[16,7,16,8],[16,9,16,11],[17,0,17,2],[17,3,17,6],[17,7,17,8],[17,9,17,11],[22,0,22,2],[22,3,22,6],[22,7,22,8],[22,9,22,11],[23,0,23,2],[23,3,23,6],[23,7,23,8],[23,9,23,11],[20,0,20,3],[20,4,20,11],[21,0,21,2],[21,3,21,6],[21,7,21,8],[21,9,21,11],[26,0,26,2],[26,3,26,6],[26,7,26,8],[26,9,26,11],[27,0,27,2],[27,3,27,6],[27,7,27,8],[27,9,27,11],[24,0,24,2],[24,3,24,6],[24,7,24,8],[24,9,24,11],[25,0,25,2],[25,3,25,6],[25,7,25,8],[25,9,25,11],[30,0,30,2],[30,3,30,6],[30,7,30,8],[30,9,30,11],[31,0,31,2],[31,3,31,6],[31,7,31,8],[31,9,31,11],[28,0,28,2],[28,3,28,6],[28,7,28,8],[28,9,28,11],[29,0,29,2],[29,3,29,6],[29,7,29,8],[29,9,29,11],[34,0,34,2],[34,3,34,6],[34,7,34,8],[34,9,34,11],[35,0,35,2],[35,3,35,6],[35,7,35,8],[35,9,35,11],[32,0,32,2],[32,3,32,6],[32,7,32,8],[32,9,32,11],[33,0,33,2],[33,3,33,6],[33,7,33,8],[33,9,33,11],[38,0,38,2],[38,3,38,6],[38,7,38,8],[38,9,38,11],[39,0,39,2],[39,3,39,6],[39,7,39,8],[39,9,39,11],[36,0,36,2],[36,3,36,6],[36,7,36,8],[36,9,36,11],[37,0,37,2],[37,3,37,6],[37,7,37,8],[37,9,37,11],[42,0,42,2],[42,3,42,6],[42,7,42,8],[42,9,42,11],[43,0,43,2],[43,3,43,6],[43,7,43,8],[43,9,43,11],[40,0,40,2],[40,3,40,6],[40,7,40,8],[40,9,40,11],[41,0,41,2],[41,3,41,6],[41,7,41,8],[41,9,41,11],[46,0,46,2],[46,3,46,6],[46,7,46,8],[46,9,46,11],[47,0,47,2],[47,3,47,6],[47,7,47,8],[47,9,47,11],[44,0,44,2],[44,3,44,6],[44,7,44,8],[44,9,44,11],[45,0,45,2],[45,3,45,6],[45,7,45,8],[45,9,45,11],[50,0,50,2],[50,3,50,6],[50,7,50,8],[50,9,50,11],[51,0,51,2],[51,3,51,6],[51,7,51,8],[51,9,51,11],[48,0,48,2],[48,3,48,6],[48,7,48,8],[48,9,48,11],[49,0,49,2],[49,3,49,6],[49,7,49,8],[49,9,49,11],[54,0,54,2],[54,3,54,6],[54,7,54,8],[54,9,54,11],[55,0,55,2],[55,3,55,6],[55,7,55,8],[55,9,55,11],[52,0,52,2],[52,3,52,6],[52,7,52,8],[52,9,52,11],[53,0,53,2],[53,3,53,6],[53,7,53,8],[53,9,53,11],[58,0,58,2],[58,3,58,6],[58,7,58,8],[58,9,58,11],[59,0,59,2],[59,3,59,6],[59,7,59,8],[59,9,59,11],[56,0,56,2],[56,3,56,6],[56,7,56,8],[56,9,56,11],[57,0,57,2],[57,3,57,6],[57,7,57,8],[57,9,57,11],[62,0,62,2],[62,3,62,6],[62,7,62,8],[62,9,62,11],[63,0,63,2],[63,3,63,6],[63,7,63,8],[63,9,63,11],[60,0,60,2],[60,3,60,6],[60,7,60,8],[60,9,60,11],[61,0,61,2],[61,3,61,6],[61,7,61,8],[61,9,61,11],[66,0,66,2],[66,3,66,6],[66,7,66,8],[66,9,66,11],[67,0,67,2],[67,3,67,6],[67,7,67,8],[67,9,67,11],[64,0,64,2],[64,3,64,6],[64,7,64,8],[64,9,64,11],[65,0,65,2],[65,3,65,6],[65,7,65,8],[65,9,65,11],[70,0,70,2],[70,3,70,6],[70,7,70,8],[70,9,70,11],[71,0,71,2],[71,3,71,6],[71,7,71,8],[71,9,71,11],[68,0,68,2],[68,3,68,6],[68,7,68,8],[68,9,68,11],[69,0,69,2],[69,3,69,6],[69,7,69,8],[69,9,69,11],[74,0,74,2],[74,3,74,6],[74,7,74,8],[74,9,74,11],[75,0,75,2],[75,3,75,6],[75,7,75,8],[75,9,75,11],[72,0,72,2],[72,3,72,6],[72,7,72,8],[72,9,72,11],[73,0,73,2],[73,3,73,6],[73,7,73,8],[73,9,73,11],[78,0,78,2],[78,3,78,6],[78,7,78,8],[78,9,78,11],[79,0,79,2],[79,3,79,6],[79,7,79,8],[79,9,79,11],[76,0,76,2],[76,3,76,6],[76,7,76,8],[76,9,76,11],[77,0,77,2],[77,3,77,6],[77,7,77,8],[77,9,77,11],[82,0,82,2],[82,3,82,6],[82,7,82,8],[82,9,82,11],[83,0,83,2],[83,3,83,6],[83,7,83,8],[83,9,83,11],[80,0,80,2],[80,3,80,6],[80,7,80,8],[80,9,80,11],[81,0,81,2],[81,3,81,6],[81,7,81,8],[81,9,81,11],[86,0,86,2],[86,3,86,6],[86,7,86,8],[86,9,86,11],[87,0,87,2],[87,3,87,6],[87,7,87,8],[87,9,87,11],[84,0,84,2],[84,3,84,6],[84,7,84,8],[84,9,84,11],[85,0,85,2],[85,3,85,6],[85,7,85,8],[85,9,85,11],[90,0,90,2],[90,3,90,6],[90,7,90,8],[90,9,90,11],[91,0,91,2],[91,3,91,6],[91,7,91,8],[91,9,91,11],[88,0,88,2],[88,3,88,6],[88,7,88,8],[88,9,88,11],[89,0,89,2],[89,3,89,6],[89,7,89,8],[89,9,89,11],[94,0,94,2],[94,3,94,6],[94,7,94,8],[94,9,94,11],[95,0,95,2],[95,3,95,6],[95,7,95,8],[95,9,95,11],[92,0,92,2],[92,3,92,6],[92,7,92,8],[92,9,92,11],[93,0,93,2],[93,3,93,6],[93,7,93,8],[93,9,93,11],[98,0,98,2],[98,3,98,6],[98,7,98,8],[98,9,98,11],[99,0,99,2],[99,3,99,6],[99,7,99,8],[99,9,99,11],[96,0,96,2],[96,3,96,6],[96,7,96,8],[96,9,96,11],[97,0,97,2],[97,3,97,6],[97,7,97,8],[97,9,97,11],[102,0,102,2],[102,3,102,6],[102,7,102,8],[102,9,102,11],[103,0,103,2],[103,3,103,6],[103,7,103,8],[103,9,103,11],[100,0,100,2],[100,3,100,6],[100,7,100,8],[100,9,100,11],[101,0,101,2],[101,3,101,6],[101,7,101,8],[101,9,101,11],[106,0,106,2],[106,3,106,6],[106,7,106,8],[106,9,106,11],[107,0,107,2],[107,3,107,6],[107,7,107,8],[107,9,107,11],[104,0,104,2],[104,3,104,6],[104,7,104,8],[104,9,104,11],[105,0,105,2],[105,3,105,6],[105,7,105,8],[105,9,105,11],[110,0,110,2],[110,3,110,6],[110,7,110,8],[110,9,110,11],[111,0,111,2],[111,3,111,6],[111,7,111,8],[111,9,111,11],[108,0,108,2],[108,3,108,6],[108,7,108,8],[108,9,108,11],[109,0,109,2],[109,3,109,6],[109,7,109,8],[109,9,109,11],[114,0,114,2],[114,3,114,6],[114,7,114,8],[114,9,114,11],[115,0,115,2],[115,3,115,6],[115,7,115,8],[115,9,115,11],[112,0,112,2],[112,3,112,6],[112,7,112,8],[112,9,112,11],[113,0,113,2],[113,3,113,6],[113,7,113,8],[113,9,113,11],[118,0,118,2],[118,3,118,6],[118,7,118,8],[118,9,118,11],[119,0,119,2],[119,3,119,6],[119,7,119,8],[119,9,119,11],[116,0,116,2],[116,3,116,6],[116,7,116,8],[116,9,116,11],[117,0,117,2],[117,3,117,6],[117,7,117,8],[117,9,117,11],[122,0,122,2],[122,3,122,6],[122,7,122,8],[122,9,122,11],[123,0,123,2],[123,3,123,6],[123,7,123,8],[123,9,123,11],[120,0,120,2],[120,3,120,6],[120,7,120,8],[120,9,120,11],[121,0,121,2],[121,3,121,6],[121,7,121,8],[121,9,121,11],[126,0,126,2],[126,3,126,6],[126,7,126,8],[126,9,126,11],[127,0,127,2],[127,3,127,6],[127,7,127,8],[127,9,127,11],[124,0,124,2],[124,3,124,6],[124,7,124,8],[124,9,124,11],[125,0,125,2],[125,3,125,6],[125,7,125,8],[125,9,125,11],[130,0,130,2],[130,3,130,6],[130,7,130,8],[130,9,130,11],[131,0,131,2],[131,3,131,6],[131,7,131,8],[131,9,131,11],[128,0,128,2],[128,3,128,6],[128,7,128,8],[128,9,128,11],[129,0,129,2],[129,3,129,6],[129,7,129,8],[129,9,129,11],[134,0,134,2],[134,3,134,6],[134,7,134,8],[134,9,134,11],[135,0,135,2],[135,3,135,6],[135,7,135,8],[135,9,135,11],[132,0,132,2],[132,3,132,6],[132,7,132,8],[132,9,132,11],[133,0,133,2],[133,3,133,6],[133,7,133,8],[133,9,133,11],[138,0,138,2],[138,3,138,6],[138,7,138,8],[138,9,138,11],[139,0,139,2],[139,3,139,6],[139,7,139,8],[139,9,139,11],[136,0,136,2],[136,3,136,6],[136,7,136,8],[136,9,136,11],[137,0,137,2],[137,3,137,6],[137,7,137,8],[137,9,137,11],[142,0,142,2],[142,3,142,6],[142,7,142,8],[142,9,142,11],[143,0,143,2],[143,3,143,6],[143,7,143,8],[143,9,143,11],[140,0,140,2],[140,3,140,6],[140,7,140,8],[140,9,140,11],[141,0,141,2],[141,3,141,6],[141,7,141,8],[141,9,141,11],[146,0,146,2],[146,3,146,6],[146,7,146,8],[146,9,146,11],[147,0,147,2],[147,3,147,6],[147,7,147,8],[147,9,147,11],[144,0,144,2],[144,3,144,6],[144,7,144,8],[144,9,144,11],[145,0,145,2],[145,3,145,6],[145,7,145,8],[145,9,145,11],[150,0,150,2],[150,3,150,6],[150,7,150,8],[150,9,150,11],[151,0,151,2],[151,3,151,6],[151,7,151,8],[151,9,151,11],[148,0,148,2],[148,3,148,6],[148,7,148,8],[148,9,148,11],[149,0,149,2],[149,3,149,6],[149,7,149,8],[149,9,149,11],[154,0,154,2],[154,3,154,6],[154,7,154,8],[154,9,154,11],[155,0,155,2],[155,3,155,6],[155,7,155,8],[155,9,155,11],[152,0,152,2],[152,3,152,6],[152,7,152,8],[152,9,152,11],[153,0,153,2],[153,3,153,6],[153,7,153,8],[153,9,153,11],[158,0,158,2],[158,3,158,6],[158,7,158,8],[158,9,158,11],[159,0,159,2],[159,3,159,6],[159,7,159,8],[159,9,159,11],[156,0,156,2],[156,3,156,6],[156,7,156,8],[156,9,156,11],[157,0,157,2],[157,3,157,6],[157,7,157,8],[157,9,157,11],[162,0,162,2],[162,3,162,6],[162,7,162,8],[162,9,162,11],[163,0,163,2],[163,3,163,6],[163,7,163,8],[163,9,163,11],[160,0,160,2],[160,3,160,6],[160,7,160,8],[160,9,160,11],[161,0,161,2],[161,3,161,6],[161,7,161,8],[161,9,161,11],[166,0,166,2],[166,3,166,6],[166,7,166,8],[166,9,166,11],[167,0,167,2],[167,3,167,6],[167,7,167,8],[167,9,167,11],[164,0,164,2],[164,3,164,6],[164,7,164,8],[164,9,164,11],[165,0,165,2],[165,3,165,6],[165,7,165,8],[165,9,165,11],[170,0,170,2],[170,3,170,6],[170,7,170,8],[170,9,170,11],[171,0,171,2],[171,3,171,6],[171,7,171,8],[171,9,171,11],[168,0,168,2],[168,3,168,6],[168,7,168,8],[168,9,168,11],[169,0,169,2],[169,3,169,6],[169,7,169,8],[169,9,169,11],[177,0,177,11],[178,0,178,11],[174,0,174,2],[174,3,174,6],[174,7,174,8],[174,9,174,11],[175,0,175,11],[176,0,176,11],[172,0,172,2],[172,3,172,6],[172,7,172,8],[172,9,172,11],[173,0,173,2],[173,3,173,6],[173,7,173,8],[173,9,173,11]]}
["Tabel 5. Kontanthjælp og uddannelseshjælp, jf. lov om aktiv socialpolitik (LBK nr. 269 af 21. marts 2017)"]
[null,null,null,"Lovhenvisning",null,null,null,"Enhed",null,"Sats"]
["Kontanthjælp"]
["Fyldt 30 år, forsørger børn",null,null,"§ 25, stk. 2, nr. 1",null,null,null,"Kr. pr. måned",null,14993]
["Fyldt 30 år, andre",null,null,"§ 25, stk. 2, nr. 2",null,null,null,"Kr. pr. måned",null,11282]
["Enlige forsørgere under 30 år",null,null,"§ 25, stk. 3, nr. 1",null,null,null,"Kr. pr. måned",null,14331]
["Forsørgere under 30 år, som ikke har erhvervet ret til ekstra børnetilskud",null,null,"§ 25, stk. 3, nr. 2",null,null,null,"Kr. pr. måned",null,10026]
["Under 30 år, gravid (passeret 12. svangerskabsuge)",null,null,"§ 25, stk. 3, nr. 3",null,null,null,"Kr. pr. måned",null,11282]
["Under 30 år, psykisk syg, forsørgelsespligt",null,null,"§ 25, stk. 3, nr. 4",null,null,null,"Kr. pr. måned",null,14993]
["Under 30 år, psykisk syg, udeboende",null,null,"§ 25, stk. 3, nr. 5",null,null,null,"Kr. pr. måned",null,11282]
["25-29 år, udeboende",null,null,"§ 25, stk. 3, nr. 6",null,null,null,"Kr. pr. måned",null,7272]
["25-29 år, hjemmeboende",null,null,"§ 25, stk. 3, nr. 7",null,null,null,"Kr. pr. måned",null,3509]
["Under 25 år, udeboende",null,null,"§ 25, stk. 3, nr. 8",null,null,null,"Kr. pr. måned",null,7272]
["Under 25 år, hjemmeboende",null,null,"§ 25, stk. 3, nr. 9",null,null,null,"Kr. pr. måned",null,3509]
["Under 30 år, bidragspligt, maksimum hjælp inkl. tillæg",null,null,"§ 25, stk. 4",null,null,null,"Kr. pr. måned",null,14993]
["Aktivitetstillæg/Barselstillæg til kontanthjælp"]
["Enlige forsørgere under 30 år,",null,null,"§ 25, stk. 9, nr. 1",null,null,null,"Kr. pr. måned",null,662]
["Forsørgere under 30 år, som ikke har erhvervet ret til ekstra børnetilskud.",null,null,"§ 25, stk. 9, nr. 2",null,null,null,"Kr. pr. måned",null,4967]
["25-29 år, udeboende",null,null,"§ 25, stk. 9, nr. 3",null,null,null,"Kr. pr. måned",null,4011]
["25-29 år, hjemmeboende",null,null,"§ 25, stk. 9, nr. 4",null,null,null,"Kr. pr. måned",null,7774]
["Periodesanktioner – fradrag i kontanthjælp 12)"]
["Fyldt 30 år, forsørger børn",null,null,"§ 35, stk. 3",null,null,null,"Kr. pr. dag",null,692]
["Fyldt 30 år, andre",null,null,"§ 35, stk. 3",null,null,null,"Kr. pr. dag",null,521]
["Enlige forsørgere under 30 år",null,null,"§ 35, stk. 3",null,null,null,"Kr. pr. dag",null,661]
["Forsørgere under 30 år, som ikke har erhvervet ret til ekstra børnetilskud",null,null,"§ 35, stk. 3",null,null,null,"Kr. pr. dag",null,463]
["Under 30 år, gravid (passeret 12. svangerskabsuge)",null,null,"§ 35, stk. 3",null,null,null,"Kr. pr. dag",null,521]
["Under 30 år, psykisk syg, forsørgelsespligt",null,null,"§ 35, stk. 3",null,null,null,"Kr. pr. dag",null,692]
["Under 30 år, psykisk syg, udeboende",null,null,"§ 35, stk. 3",null,null,null,"Kr. pr. dag",null,521]
["25-29 år, udeboende",null,null,"§ 35, stk. 3",null,null,null,"Kr. pr. dag",null,336]
["25-29 år, hjemmeboende",null,null,"§ 35, stk. 3",null,null,null,"Kr. pr. dag",null,162]
["Under 25 år, udeboende",null,null,"§ 35, stk. 3",null,null,null,"Kr. pr. dag",null,336]
["Under 25 år, hjemmeboende",null,null,"§ 35, stk. 3",null,null,null,"Kr. pr. dag",null,162]
["Under 30 år, bidragspligt, maksimum hjælp inkl. tillæg",null,null,"§ 35, stk. 3",null,null,null,"Kr. pr. dag",null,692]
["Periodesanktioner – fradrag i aktivitetstillæg til kontanthjælp 12)"]
["Enlige forsørgere under 30 år",null,null,"§ 35, stk. 3",null,null,null,"Kr. pr. dag",null,31]
["Forsørger under 30 år, som ikke har erhvervet ret til ekstra børnetilskud.",null,null,"§ 35, stk. 3",null,null,null,"Kr. pr. dag",null,229]
["25-29 år, udeboende",null,null,"§ 35, stk. 3",null,null,null,"Kr. pr. dag",null,185]
["25-29 år, hjemmeboende",null,null,"§ 35, stk. 3",null,null,null,"Kr. pr. dag",null,359]
["Punktsanktioner – nedsættelse af kontanthjælp 12)"]
["Fyldt 30 år, forsørger børn",null,null,"§ 40, stk. 1",null,null,null,"Kr. pr. hændelse",null,2076]
["Fyldt 30 år, andre",null,null,"§ 40, stk. 1",null,null,null,"Kr. pr. hændelse",null,1563]
["Enlige forsørgere under 30 år",null,null,"§ 40, stk. 1",null,null,null,"Kr. pr. hændelse",null,1983]
["Forsørgere under 30 år, som ikke har erhvervet ret til ekstra børnetilskud.",null,null,"§ 40, stk. 1",null,null,null,"Kr. pr. hændelse",null,1389]
["Under 30 år, gravid (passeret 12. svangerskabsuge)",null,null,"§ 40, stk. 1",null,null,null,"Kr. pr. hændelse",null,1563]
["Under 30 år, psykisk syg, forsørgelsespligt",null,null,"§ 40, stk. 1",null,null,null,"Kr. pr. hændelse",null,2076]
["Under 30 år, psykisk syg, udeboende",null,null,"§ 40, stk. 1",null,null,null,"Kr. pr. hændelse",null,1563]
["25-29 år, udeboende",null,null,"§ 40, stk. 1",null,null,null,"Kr. pr. hændelse",null,1008]
["25-29 år, hjemmeboende",null,null,"§ 40, stk. 1",null,null,null,"Kr. pr. hændelse",null,486]
["Under 25 år, udeboende",null,null,"§ 40, stk. 1",null,null,null,"Kr. pr. hændelse",null,1008]
["Under 25 år, hjemmeboende",null,null,"§ 40, stk. 1",null,null,null,"Kr. pr. hændelse",null,486]
["Under 30 år, bidragspligt, maksimum hjælp inkl. tillæg",null,null,"§ 40, stk. 1",null,null,null,"Kr. pr. hændelse",null,2076]
["Punktsanktioner – nedsættelse i aktivitetstillæg til kontanthjælp 12)"]
["Enlige forsørgere under 30 år",null,null,"§ 40, stk. 1",null,null,null,"Kr. pr. hændelse",null,93]
["Forsørgere under 30 år, som ikke har erhvervet ret til ekstra børnetilskud",null,null,"§ 40, stk. 1",null,null,null,"Kr. pr. hændelse",null,687]
["25-29 år, udeboende",null,null,"§ 40, stk. 1",null,null,null,"Kr. pr. hændelse",null,555]
["25-29 år, hjemmeboende",null,null,"§ 40, stk. 1",null,null,null,"Kr. pr. hændelse",null,1077]
["Sanktion ved uberettiget modtagelse af hjælp efter §§ 22-25 samtidig med arbejde eller ophold i udlandet"]
["Minimum ydelse",null,null,"§ 42, stk. 1",null,null,null,"Kr. pr. måned",null,11446]
["Uddannelseshjælp"]
["Enlige forsørgere under 30 år",null,null,"§ 23, stk. 2, nr. 1",null,null,null,"Kr. pr. måned",null,12364]
["Forsørgere under 30 år, som ikke har erhvervet ret til ekstra børnetilskud",null,null,"§ 23, stk. 2, nr. 2",null,null,null,"Kr. pr. måned",null,8653]
["Under 30 år, gravid (passeret 12. svangerskabsuge)",null,null,"§ 23, stk. 2, nr. 3",null,null,null,"Kr. pr. måned",null,11282]
["Under 30 år, psykisk syg, forsørgelsespligt",null,null,"§ 23, stk. 2, nr. 4",null,null,null,"Kr. pr. måned",null,14993]
["Under 30 år, psykisk syg, udeboende",null,null,"§ 23, stk. 2, nr. 5",null,null,null,"Kr. pr. måned",null,11282]
["25-29 år, udeboende",null,null,"§ 23, stk. 2, nr. 6",null,null,null,"Kr. pr. måned",null,6182]
["25-29 år, hjemmeboende",null,null,"§ 23, stk. 2, nr. 7",null,null,null,"Kr. pr. måned",null,2664]
["Under 25 år, udeboende",null,null,"§ 23, stk. 2, nr. 8",null,null,null,"Kr. pr. måned",null,6182]
["Under 25 år, hjemmeboende",null,null,"§ 23, stk. 2, nr. 9",null,null,null,"Kr. pr. måned",null,2664]
["Under 30 år, bidragspligt, maksimum hjælp inkl. tillæg",null,null,"§ 23, stk. 3",null,null,null,"Kr. pr. måned",null,14993]
["Aktivitetstillæg/Barselstillæg til uddannelseshjælp"]
["Enlige forsørgere under 30 år",null,null,"§ 24, stk. 3, nr. 1",null,null,null,"Kr. pr. måned",null,2629]
["Forsørgere under 30 år, som ikke har erhvervet ret til ekstra børnetilskud.",null,null,"§ 24, stk. 3, nr. 2",null,null,null,"Kr. pr. måned",null,6341]
["25-29 år, udeboende",null,null,"§ 24, stk. 3, nr. 3",null,null,null,"Kr. pr. måned",null,5100]
["25-29 år, hjemmeboende",null,null,"§ 24, stk. 3, nr. 4",null,null,null,"Kr. pr. måned",null,8618]
["Under 25 år, udeboende",null,null,"§ 24, stk. 3, nr. 5",null,null,null,"Kr. pr. måned",null,1089]
["Under 25 år, hjemmeboende",null,null,"§ 24, stk. 3, nr. 6",null,null,null,"Kr. pr. måned",null,844]
["Periodesanktioner – fradrag i uddannelseshjælp 12)"]
["Enlige forsørgere under 30 år",null,null,"§ 35, stk. 3",null,null,null,"Kr. pr. dag",null,571]
["Forsørgere under 30 år, som ikke har erhvervet ret til ekstra børnetilskud",null,null,"§ 35, stk. 3",null,null,null,"Kr. pr. dag",null,399]
["Under 30 år, gravid (passeret 12. svangerskabsuge)",null,null,"§ 35, stk. 3",null,null,null,"Kr. pr. dag",null,521]
["Under 30 år, psykisk syg, forsørgelsespligt",null,null,"§ 35, stk. 3",null,null,null,"Kr. pr. dag",null,692]
["Under 30 år, psykisk syg, udeboende",null,null,"§ 35, stk. 3",null,null,null,"Kr. pr. dag",null,521]
["25-29 år, udeboende",null,null,"§ 35, stk. 3",null,null,null,"Kr. pr. dag",null,285]
["25-29 år, hjemmeboende",null,null,"§ 35, stk. 3",null,null,null,"Kr. pr. dag",null,123]
["Under 25 år, udeboende",null,null,"§ 35, stk. 3",null,null,null,"Kr. pr. dag",null,285]
["Under 25 år, hjemmeboende",null,null,"§ 35, stk. 3",null,null,null,"Kr. pr. dag",null,123]
["Under 30 år, bidragspligt, maksimum hjælp inkl. tillæg",null,null,"§ 35, stk. 3",null,null,null,"Kr. pr. dag",null,692]
["Periodesanktioner – fradrag i aktivitetstillæg til uddannelseshjælp 12)"]
["Enlige forsørgere under 30 år",null,null,"§ 35, stk. 3",null,null,null,"Kr. pr. dag",null,121]
["Forsørgere under 30 år, som ikke har erhvervet ret til ekstra børnetilskud",null,null,"§ 35, stk. 3",null,null,null,"Kr. pr. dag",null,293]
["25-29 år, udeboende",null,null,"§ 35, stk. 3",null,null,null,"Kr. pr. dag",null,235]
["25-29 år, hjemmeboende",null,null,"§ 35, stk. 3",null,null,null,"Kr. pr. dag",null,398]
["Under 25 år, udeboende",null,null,"§ 35, stk. 3",null,null,null,"Kr. pr. dag",null,50]
["Under 25 år, hjemmeboende",null,null,"§ 35, stk. 3",null,null,null,"Kr. pr. dag",null,39]
["Punktsanktioner – nedsættelse af uddannelseshjælp 12)"]
["Enlige forsørgere under 30 år",null,null,"§ 40, stk. 1",null,null,null,"Kr. pr. hændelse",null,1713]
["Forsørgere under 30 år, som ikke har erhvervet ret til ekstra børnetilskud",null,null,"§ 40, stk. 1",null,null,null,"Kr. pr. hændelse",null,1197]
["Under 30 år, gravid (passeret 12. svangerskabsuge)",null,null,"§ 40, stk. 1",null,null,null,"Kr. pr. hændelse",null,1563]
["Under 30 år, psykisk syg, forsørgelsespligt",null,null,"§ 40, stk. 1",null,null,null,"Kr. pr. hændelse",null,2076]
["Under 30 år, psykisk syg, udeboende",null,null,"§ 40, stk. 1",null,null,null,"Kr. pr. hændelse",null,1563]
["25-29 år, udeboende",null,null,"§ 40, stk. 1",null,null,null,"Kr. pr. hændelse",null,855]
["25-29 år, hjemmeboende",null,null,"§ 40, stk. 1",null,null,null,"Kr. pr. hændelse",null,369]
["Under 25 år, udeboende",null,null,"§ 40, stk. 1",null,null,null,"Kr. pr. hændelse",null,855]
["Under 25 år, hjemmeboende",null,null,"§ 40, stk. 1",null,null,null,"Kr. pr. hændelse",null,369]
["Under 30 år, bidragspligt, maksimum hjælp inkl. tillæg",null,null,"§ 40, stk. 1",null,null,null,"Kr. pr. hændelse",null,2076]
["Punktsanktioner – nedsættelse af aktivitetstillæg til uddannelseshjælp 12)"]
["Enlige forsørgere under 30 år",null,null,"§ 40, stk. 1",null,null,null,"Kr. pr. hændelse",null,363]
["Forsørgere under 30 år, som ikke har erhvervet ret til ekstra børnetilskud",null,null,"§ 40, stk. 1",null,null,null,"Kr. pr. hændelse",null,879]
["25-29 år, udeboende",null,null,"§ 40, stk. 1",null,null,null,"Kr. pr. hændelse",null,705]
["25-29 år, hjemmeboende",null,null,"§ 40, stk. 1",null,null,null,"Kr. pr. hændelse",null,1194]
["Under 25 år, udeboende",null,null,"§ 40, stk. 1",null,null,null,"Kr. pr. hændelse",null,150]
["Under 25 år, hjemmeboende",null,null,"§ 40, stk. 1",null,null,null,"Kr. pr. hændelse",null,117]
["Sanktion ved uberettiget modtagelse af hjælp efter §§ 22-25 samtidig med arbejde eller ophold i udlandet"]
["Minimum ydelse",null,null,"§ 42, stk. 1",null,null,null,"Kr. pr. måned",null,11446]
["Kontanthjælpsloft for modtagere af hjælp efter §§ 23-25 med et beløb svarende til satserne i § 25, stk. 2"]
["Gifte/samlevende, forsørgere",null,null,"§ 25 b, stk. 1, nr. 1",null,null,null,"Kr. pr. måned",null,14993]
["Gifte/samlevende, ikke forsørgere",null,null,"§ 25 b, stk. 1, nr. 2",null,null,null,"Kr. pr. måned",null,11282]
["Enlige, forsørger, 1 barn",null,null,"§ 25 b, stk. 1, nr. 3",null,null,null,"Kr. pr. måned",null,15632]
["Enlige, forsørger, 2 eller flere børn",null,null,"§ 25 b, stk. 1, nr. 4",null,null,null,"Kr. pr. måned",null,16001]
["Enlige, ikke forsørger",null,null,"§ 25 b, stk. 1, nr. 5",null,null,null,"Kr. pr. måned",null,13645]
["Kontanthjælpsloft for modtagere af hjælp efter § 25, stk. 3, og som ikke er omfattet af § 25 b, stk. 1"]
["Gifte/samlevende, forsørgere, 1 barn",null,null,"§ 25 b, stk. 2, nr. 1",null,null,null,"Kr. pr. måned",null,12801]
["Gifte/samlevende, forsørgere, 2 eller flere børn",null,null,"§ 25 b, stk. 2, nr. 2",null,null,null,"Kr. pr. måned",null,12674]
["Gifte/samlevende, ikke forsørgere",null,null,"§ 25 b, stk. 2, nr. 3",null,null,null,"Kr. pr. måned",null,9723]
["Enlige, forsørger, 1 barn",null,null,"§ 25 b, stk. 2, nr. 4",null,null,null,"Kr. pr. måned",null,15323]
["Enlige, forsørger, 2 eller flere børn",null,null,"§ 25 b, stk. 2, nr. 5",null,null,null,"Kr. pr. måned",null,15692]
["Enlige, ikke forsørger",null,null,"§ 25 b, stk. 2, nr. 6",null,null,null,"Kr. pr. måned",null,10445]
["Kontanthjælpsloft for modtagere af hjælp efter §§ 23-24, og som ikke er omfattet af § 25 b, stk.1"]
["Gifte/samlevende, forsørgere, 1 barn",null,null,"§ 25 b, stk. 3, nr. 1",null,null,null,"Kr. pr. måned",null,12208]
["Gifte/samlevende, forsørgere, 2 eller flere børn",null,null,"§ 25 b, stk. 3, nr. 2",null,null,null,"Kr. pr. måned",null,12043]
["Gifte/samlevende, ikke forsørgere",null,null,"§ 25 b, stk. 3, nr. 3",null,null,null,"Kr. pr. måned",null,9317]
["Enlige, forsørger, 1 barn",null,null,"§ 25 b, stk. 3, nr. 4",null,null,null,"Kr. pr. måned",null,14579]
["Enlige, forsørger, 2 eller flere børn",null,null,"§ 25 b, stk. 3, nr. 5",null,null,null,"Kr. pr. måned",null,14947]
["Enlige, ikke forsørger",null,null,"§ 25 b, stk. 3, nr. 6",null,null,null,"Kr. pr. måned",null,10034]
["Kontanthjælpsloft for ægtefæller, hvor en eller begge modtager integrationsydelse, og som ikke opfylder 225 timers kravet (Ægtefæller omfattet af § 13 f, stk. 3 og 4)*"]
["Ej nedsat hjælp, forsørger, 1 barn",null,null,"§ 25 b, stk. 5, nr. 1",null,null,null,"Kr. pr. måned",null,9088]
["Ej nedsat hjælp, forsørger, 2 eller flere børn",null,null,"§ 25 b, stk. 5, nr. 2",null,null,null,"Kr. pr. måned",null,9157]
["Ej nedsat hjælp, ikke forsørger",null,null,"§ 25 b, stk. 5, nr. 3",null,null,null,"Kr. pr. måned",null,6108]
["Nedsat hjælp, forsørger, 1 barn",null,null,"§ 25 b, stk. 5, nr. 4",null,null,null,"Kr. pr. måned",null,7322]
["Nedsat hjælp, forsørger, 2 eller flere børn",null,null,"§ 25 b, stk. 5, nr. 5",null,null,null,"Kr. pr. måned",null,7391]
["Nedsat hjælp, ikke forsørger",null,null,"§ 25 b, stk. 5, nr. 6",null,null,null,"Kr. pr. måned",null,5408]
["Nedsættelse af hjælpen til ugifte personer, der ikke opfylder kravet om 225 timers ordinært og ustøttet arbejde inden for de seneste 12 kalendermåneder"]
["Hjælp beregnet på baggrund af 14.993 kr./11.282 kr. pr. måned",null,null,"§ 13 g, stk. 1, nr. 1",null,null,null,"Kr. pr. måned",null,1029]
["Hjælp beregnet på baggrund af mindre end 14.993 kr./11.282 kr. pr. måned",null,null,"§ 13 g, stk. 1, nr. 2",null,null,null,"Kr. pr. måned",null,514]
["Omregningssats for ukendt arbejdstid til 225 timers-regel"]
["Omregningssats",null,null,"§ 13 f, stk. 15",null,null,null,"Kr. pr. time",null,122.5]
["Ægtefælleberegning – 225 timers-regel"]
["Forsørgere",null,null,"§ 26, stk. 5-8",null,null,null,"Kr. pr. måned",null,14993]
["Ikke-forsørgere",null,null,"§ 26, stk. 5-8",null,null,null,"Kr. pr. måned",null,11282]
["Engangshjælp"]
["Over 25 år, samt udeboende under 25 år (maksimum)",null,null,"§ 25 a, stk. 2",null,null,null,"Kr. pr. måned",null,6030]
["Hjemmeboende under 25 år (maksimum)",null,null,"§ 25 a, stk. 3",null,null,null,"Kr. pr. måned",null,2998]
["Hjælp til visse persongrupper"]
["Nået efterlønsalderen, ikke optjent pensionsret",null,null,"§ 27, stk. 1",null,null,null,"Kr. pr. måned",null,9570]
["Børnestøttebeløb, ikke optjent pensionsret",null,null,"§ 27, stk. 2",null,null,null,"Kr. pr. måned",null,3032]
["Enlige forsørgere – under 30 år (maksimum)",null,null,"§ 12, stk. 3",null,null,null,"Kr. pr. måned",null,12364]
["Fradrag ved formue og indtægt, beløb der ses bort fra"]
["Formue, enlige",null,null,"§ 14, stk. 1",null,null,null,"Kr. pr. måned",null,10000]
["Formue, ægtefæller",null,null,"§ 14, stk. 1",null,null,null,"Kr. pr. måned",null,20000]
["Formue, engangsbeløb fra forsikring ved kritisk sygdom",null,null,"§ 14, stk. 8",null,null,null,"Kr. pr. forsikringsbegivenhed",null,150000]
["Forsørgelsesydelse, ægtefæller, forsørgelsespligt",null,null,"§ 30, stk. 2",null,null,null,"Kr. pr. måned",null,14993]
["Forsørgelsesydelse, ægtefæller, andre",null,null,"§ 30, stk. 2",null,null,null,"Kr. pr. måned",null,11282]
["Fradrag pr. arbejdstime ved arbejdsindtægt",null,null,"§ 31, stk. 1",null,null,null,"Kr. pr. time",null,26.78]
["Fradrag for indtægter ved arbejde - STU (maksimumbeløb)",null,null,"§ 31, stk. 2",null,null,null,"Kr. pr. år",null,25319]
["Arbejdstillæg, ukendt arbejdstimer, omregningssats",null,null,"§ 31, stk. 3",null,null,null,"Kr. pr. time",null,235.6]
["Særlig støtte, grænsebeløb, boligudgift 13)"]
["Ikke-forsørgere",null,null,"§ 34, stk. 8",null,null,null,"Kr. pr. måned",null,3000]
["Forsørgere med et hjemmeboende barn",null,null,"§ 34, stk. 8",null,null,null,"Kr. pr. måned",null,4300]
["Forsørgere med et udeboende barn",null,null,"§ 34, stk. 8",null,null,null,"Kr. pr. måned",null,4400]
["Fradrag i grænsebeløbet pr. barn hjemme udover 1",null,null,"§ 34, stk. 8",null,null,null,"Kr. pr. måned",null,800]
["Fradrag i grænsebeløbet pr. barn ude udover 1",null,null,"§ 34, stk. 8",null,null,null,"Kr. pr. måned",null,650]
["Indtægtsgrænse efter 3 måneder - dagpengemaksimum",null,null,"§ 34, stk. 8",null,null,null,"Kr. pr. måned",null,18633]
["Grænse uafhængig af tidligere indtægter - integrationsydelse",null,null,"§ 34, stk. 8",null,null,null,"Kr. pr. måned",null,13233]
["Fradrag for forskudsvis udlagt børnebidrag"]
["Samlede udbetalt beløb (minimumsbeløb)",null,null,"§ 96 a, stk. 1",null,null,null,"Kr. pr. måned",null,14993]
["12) Bestemmelserne under ”Sanktioner” henviser til sanktionsbestemmelserne i §§ 35-41 i LBK nr. 269 af 21. marts 2017 af lov om aktiv socialpolitik med senere ændringer og vejledning nr. 10013 af 13. oktober 2016 om rådighed og sanktioner for personer, der ansøger om eller modtager integrationsydelse, uddannelseshjælp eller kontanthjælp."]
["13) Jf. BEK nr. 894 af 29. juni 2017 om særlig støtte efter § 34 i lov om aktiv socialpolitik."]
["*Satserne træder i kraft den 1. juli 2018."]

{"sheet":"2018-1 sats","index":12,"n_rows":174,"n_cols":10,"rows_kept":174,"cut":false,"hidden":false,"merged":[[0,0,0,11],[1,0,1,2],[1,3,1,6],[1,7,1,8],[1,9,1,11],[2,0,2,11],[5,0,5,2],[5,3,5,6],[5,7,5,8],[5,9,5,11],[6,0,6,2],[6,3,6,6],[6,7,6,8],[6,9,6,11],[3,0,3,2],[3,3,3,6],[3,7,3,8],[3,9,3,11],[4,0,4,2],[4,3,4,6],[4,7,4,8],[4,9,4,11],[9,0,9,2],[9,3,9,6],[9,7,9,8],[9,9,9,11],[10,0,10,2],[10,3,10,6],[10,7,10,8],[10,9,10,11],[7,0,7,2],[7,3,7,6],[7,7,7,8],[7,9,7,11],[8,0,8,2],[8,3,8,6],[8,7,8,8],[8,9,8,11],[13,0,13,2],[13,3,13,6],[13,7,13,8],[13,9,13,11],[14,0,14,2],[14,3,14,6],[14,7,14,8],[14,9,14,11],[11,0,11,2],[11,3,11,6],[11,7,11,8],[11,9,11,11],[12,0,12,2],[12,3,12,6],[12,7,12,8],[12,9,12,11],[15,0,15,11],[16,0,16,2],[16,3,16,6],[16,7,16,8],[16,9,16,11],[17,0,17,2],[17,3,17,6],[17,7,17,8],[17,9,17,11],[20,0,20,3],[20,4,20,11],[21,0,21,2],[21,3,21,6],[21,7,21,8],[21,9,21,11],[18,0,18,2],[18,3,18,6],[18,7,18,8],[18,9,18,11],[19,0,19,2],[19,3,19,6],[19,7,19,8],[19,9,19,11],[24,0,24,2],[24,3,24,6],[24,7,24,8],[24,9,24,11],[25,0,25,2],[25,3,25,6],[25,7,25,8],[25,9,25,11],[22,0,22,2],[22,3,22,6],[22,7,22,8],[22,9,22,11],[23,0,23,2],[23,3,23,6],[23,7,23,8],[23,9,23,11],[28,0,28,2],[28,3,28,6],[28,7,28,8],[28,9,28,11],[29,0,29,2],[29,3,29,6],[29,7,29,8],[29,9,29,11],[26,0,26,2],[26,3,26,6],[26,7,26,8],[26,9,26,11],[27,0,27,2],[27,3,27,6],[27,7,27,8],[27,9,27,11],[32,0,32,2],[32,3,32,6],[32,7,32,8],[32,9,32,11],[33,0,33,2],[33,3,33,6],[33,7,33,8],[33,9,33,11],[30,0,30,2],[30,3,30,6],[30,7,30,8],[30,9,30,11],[31,0,31,2],[31,3,31,6],[31,7,31,8],[31,9,31,11],[36,0,36,2],[36,3,36,6],[36,7,36,8],[36,9,36,11],[37,0,37,2],[37,3,37,6],[37,7,37,8],[37,9,37,11],[34,0,34,2],[34,3,34,6],[34,7,34,8],[34,9,34,11],[35,0,35,2],[35,3,35,6],[35,7,35,8],[35,9,35,11],[40,0,40,2],[40,3,40,6],[40,7,40,8],[40,9,40,11],[41,0,41,2],[41,3,41,6],[41,7,41,8],[41,9,41,11],[38,0,38,2],[38,3,38,6],[38,7,38,8],[38,9,38,11],[39,0,39,2],[39,3,39,6],[39,7,39,8],[39,9,39,11],[44,0,44,2],[44,3,44,6],[44,7,44,8],[44,9,44,11],[45,0,45,2],[45,3,45,6],[45,7,45,8],[45,9,45,11],[42,0,42,2],[42,3,42,6],[42,7,42,8],[42,9,42,11],[43,0,43,2],[43,3,43,6],[43,7,43,8],[43,9,43,11],[48,0,48,2],[48,3,48,6],[48,7,48,8],[48,9,48,11],[49,0,49,2],[49,3,49,6],[49,7,49,8],[49,9,49,11],[46,0,46,2],[46,3,46,6],[46,7,46,8],[46,9,46,11],[47,0,47,2],[47,3,47,6],[47,7,47,8],[47,9,47,11],[52,0,52,2],[52,3,52,6],[52,7,52,8],[52,9,52,11],[53,0,53,2],[53,3,53,6],[53,7,53,8],[53,9,53,11],[50,0,50,2],[50,3,50,6],[50,7,50,8],[50,9,50,11],[51,0,51,2],[51,3,51,6],[51,7,51,8],[51,9,51,11],[56,0,56,2],[56,3,56,6],[56,7,56,8],[56,9,56,11],[57,0,57,2],[57,3,57,6],[57,7,57,8],[57,9,57,11],[54,0,54,2],[54,3,54,6],[54,7,54,8],[54,9,54,11],[55,0,55,2],[55,3,55,6],[55,7,55,8],[55,9,55,11],[60,0,60,2],[60,3,60,6],[60,7,60,8],[60,9,60,11],[61,0,61,2],[61,3,61,6],[61,7,61,8],[61,9,61,11],[58,0,58,2],[58,3,58,6],[58,7,58,8],[58,9,58,11],[59,0,59,2],[59,3,59,6],[59,7,59,8],[59,9,59,11],[64,0,64,2],[64,3,64,6],[64,7,64,8],[64,9,64,11],[65,0,65,2],[65,3,65,6],[65,7,65,8],[65,9,65,11],[62,0,62,2],[62,3,62,6],[62,7,62,8],[62,9,62,11],[63,0,63,2],[63,3,63,6],[63,7,63,8],[63,9,63,11],[68,0,68,2],[68,3,68,6],[68,7,68,8],[68,9,68,11],[69,0,69,2],[69,3,69,6],[69,7,69,8],[69,9,69,11],[66,0,66,2],[66,3,66,6],[66,7,66,8],[66,9,66,11],[67,0,67,2],[67,3,67,6],[67,7,67,8],[67,9,67,11],[72,0,72,2],[72,3,72,6],[72,7,72,8],[72,9,72,11],[73,0,73,2],[73,3,73,6],[73,7,73,8],[73,9,73,11],[70,0,70,2],[70,3,70,6],[70,7,70,8],[70,9,70,11],[71,0,71,2],[71,3,71,6],[71,7,71,8],[71,9,71,11],[76,0,76,2],[76,3,76,6],[76,7,76,8],[76,9,76,11],[77,0,77,2],[77,3,77,6],[77,7,77,8],[77,9,77,11],[74,0,74,2],[74,3,74,6],[74,7,74,8],[74,9,74,11],[75,0,75,2],[75,3,75,6],[75,7,75,8],[75,9,75,11],[80,0,80,2],[80,3,80,6],[80,7,80,8],[80,9,80,11],[81,0,81,2],[81,3,81,6],[81,7,81,8],[81,9,81,11],[78,0,78,2],[78,3,78,6],[78,7,78,8],[78,9,78,11],[79,0,79,2],[79,3,79,6],[79,7,79,8],[79,9,79,11],[84,0,84,2],[84,3,84,6],[84,7,84,8],[84,9,84,11],[85,0,85,2],[85,3,85,6],[85,7,85,8],[85,9,85,11],[82,0,82,2],[82,3,82,6],[82,7,82,8],[82,9,82,11],[83,0,83,2],[83,3,83,6],[83,7,83,8],[83,9,83,11],[88,0,88,2],[88,3,88,6],[88,7,88,8],[88,9,88,11],[89,0,89,2],[89,3,89,6],[89,7,89,8],[89,9,89,11],[86,0,86,2],[86,3,86,6],[86,7,86,8],[86,9,86,11],[87,0,87,2],[87,3,87,6],[87,7,87,8],[87,9,87,11],[92,0,92,2],[92,3,92,6],[92,7,92,8],[92,9,92,11],[93,0,93,2],[93,3,93,6],[93,7,93,8],[93,9,93,11],[90,0,90,2],[90,3,90,6],[90,7,90,8],[90,9,90,11],[91,0,91,2],[91,3,91,6],[91,7,91,8],[91,9,91,11],[96,0,96,2],[96,3,96,6],[96,7,96,8],[96,9,96,11],[97,0,97,2],[97,3,97,6],[97,7,97,8],[97,9,97,11],[94,0,94,2],[94,3,94,6],[94,7,94,8],[94,9,94,11],[95,0,95,2],[95,3,95,6],[95,7,95,8],[95,9,95,11],[100,0,100,2],[100,3,100,6],[100,7,100,8],[100,9,100,11],[101,0,101,2],[101,3,101,6],[101,7,101,8],[101,9,101,11],[98,0,98,2],[98,3,98,6],[98,7,98,8],[98,9,98,11],[99,0,99,2],[99,3,99,6],[99,7,99,8],[99,9,99,11],[104,0,104,2],[104,3,104,6],[104,7,104,8],[104,9,104,11],[105,0,105,2],[105,3,105,6],[105,7,105,8],[105,9,105,11],[102,0,102,2],[102,3,102,6],[102,7,102,8],[102,9,102,11],[103,0,103,2],[103,3,103,6],[103,7,103,8],[103,9,103,11],[108,0,108,2],[108,3,108,6],[108,7,108,8],[108,9,108,11],[109,0,109,2],[109,3,109,6],[109,7,109,8],[109,9,109,11],[106,0,106,2],[106,3,106,6],[106,7,106,8],[106,9,106,11],[107,0,107,2],[107,3,107,6],[107,7,107,8],[107,9,107,11],[112,0,112,2],[112,3,112,6],[112,7,112,8],[112,9,112,11],[113,0,113,2],[113,3,113,6],[113,7,113,8],[113,9,113,11],[110,0,110,2],[110,3,110,6],[110,7,110,8],[110,9,110,11],[111,0,111,2],[111,3,111,6],[111,7,111,8],[111,9,111,11],[116,0,116,2],[116,3,116,6],[116,7,116,8],[116,9,116,11],[117,0,117,2],[117,3,117,6],[117,7,117,8],[117,9,117,11],[114,0,114,2],[114,3,114,6],[114,7,114,8],[114,9,114,11],[115,0,115,2],[115,3,115,6],[115,7,115,8],[115,9,115,11],[120,0,120,2],[120,3,120,6],[120,7,120,8],[120,9,120,11],[121,0,121,2],[121,3,121,6],[121,7,121,8],[121,9,121,11],[118,0,118,2],[118,3,118,6],[118,7,118,8],[118,9,118,11],[119,0,119,2],[119,3,119,6],[119,7,119,8],[119,9,119,11],[124,0,124,2],[124,3,124,6],[124,7,124,8],[124,9,124,11],[125,0,125,2],[125,3,125,6],[125,7,125,8],[125,9,125,11],[122,0,122,2],[122,3,122,6],[122,7,122,8],[122,9,122,11],[123,0,123,2],[123,3,123,6],[123,7,123,8],[123,9,123,11],[128,0,128,2],[128,3,128,6],[128,7,128,8],[128,9,128,11],[129,0,129,2],[129,3,129,6],[129,7,129,8],[129,9,129,11],[126,0,126,2],[126,3,126,6],[126,7,126,8],[126,9,126,11],[127,0,127,2],[127,3,127,6],[127,7,127,8],[127,9,127,11],[132,0,132,2],[132,3,132,6],[132,7,132,8],[132,9,132,11],[133,0,133,2],[133,3,133,6],[133,7,133,8],[133,9,133,11],[130,0,130,2],[130,3,130,6],[130,7,130,8],[130,9,130,11],[131,0,131,2],[131,3,131,6],[131,7,131,8],[131,9,131,11],[136,0,136,2],[136,3,136,6],[136,7,136,8],[136,9,136,11],[137,0,137,2],[137,3,137,6],[137,7,137,8],[137,9,137,11],[134,0,134,2],[134,3,134,6],[134,7,134,8],[134,9,134,11],[135,0,135,2],[135,3,135,6],[135,7,135,8],[135,9,135,11],[140,0,140,2],[140,3,140,6],[140,7,140,8],[140,9,140,11],[141,0,141,2],[141,3,141,6],[141,7,141,8],[141,9,141,11],[138,0,138,2],[138,3,138,6],[138,7,138,8],[138,9,138,11],[139,0,139,2],[139,3,139,6],[139,7,139,8],[139,9,139,11],[144,0,144,2],[144,3,144,6],[144,7,144,8],[144,9,144,11],[145,0,145,2],[145,3,145,6],[145,7,145,8],[145,9,145,11],[142,0,142,2],[142,3,142,6],[142,7,142,8],[142,9,142,11],[143,0,143,2],[143,3,143,6],[143,7,143,8],[143,9,143,11],[148,0,148,2],[148,3,148,6],[148,7,148,8],[148,9,148,11],[149,0,149,2],[149,3,149,6],[149,7,149,8],[149,9,149,11],[146,0,146,2],[146,3,146,6],[146,7,146,8],[146,9,146,11],[147,0,147,2],[147,3,147,6],[147,7,147,8],[147,9,147,11],[152,0,152,2],[152,3,152,6],[152,7,152,8],[152,9,152,11],[153,0,153,2],[153,3,153,6],[153,7,153,8],[153,9,153,11],[150,0,150,2],[150,3,150,6],[150,7,150,8],[150,9,150,11],[151,0,151,2],[151,3,151,6],[151,7,151,8],[151,9,151,11],[156,0,156,2],[156,3,156,6],[156,7,156,8],[156,9,156,11],[157,0,157,2],[157,3,157,6],[157,7,157,8],[157,9,157,11],[154,0,154,2],[154,3,154,6],[154,7,154,8],[154,9,154,11],[155,0,155,2],[155,3,155,6],[155,7,155,8],[155,9,155,11],[160,0,160,2],[160,3,160,6],[160,7,160,8],[160,9,160,11],[161,0,161,2],[161,3,161,6],[161,7,161,8],[161,9,161,11],[158,0,158,2],[158,3,158,6],[158,7,158,8],[158,9,158,11],[159,0,159,2],[159,3,159,6],[159,7,159,8],[159,9,159,11],[164,0,164,2],[164,3,164,6],[164,7,164,8],[164,9,164,11],[165,0,165,2],[165,3,165,6],[165,7,165,8],[165,9,165,11],[162,0,162,2],[162,3,162,6],[162,7,162,8],[162,9,162,11],[163,0,163,2],[163,3,163,6],[163,7,163,8],[163,9,163,11],[168,0,168,2],[168,3,168,6],[168,7,168,8],[168,9,168,11],[169,0,169,2],[169,3,169,6],[169,7,169,8],[169,9,169,11],[166,0,166,2],[166,3,166,6],[166,7,166,8],[166,9,166,11],[167,0,167,2],[167,3,167,6],[167,7,167,8],[167,9,167,11],[172,0,172,11],[173,0,173,11],[174,0,174,11],[170,0,170,2],[170,3,170,6],[170,7,170,8],[170,9,170,11],[171,0,171,2],[171,3,171,6],[171,7,171,8],[171,9,171,11]]}
["Tabel 5. Kontanthjælp og uddannelseshjælp, jf. lov om aktiv socialpolitik (LBK nr. 269 af 21. marts 2017)"]
[null,null,null,"Lovhenvisning",null,null,null,"Enhed",null,"Sats"]
["Kontanthjælp"]
["Fyldt 30 år, forsørger børn",null,null,"§ 25, stk. 2, nr. 1",null,null,null,"Kr. pr. måned",null,14993]
["Fyldt 30 år, andre",null,null,"§ 25, stk. 2, nr. 2",null,null,null,"Kr. pr. måned",null,11282]
["Enlige forsørgere under 30 år",null,null,"§ 25, stk. 3, nr. 1",null,null,null,"Kr. pr. måned",null,14331]
["Forsørgere under 30 år, som ikke har erhvervet ret til ekstra børnetilskud",null,null,"§ 25, stk. 3, nr. 2",null,null,null,"Kr. pr. måned",null,10026]
["Under 30 år, gravid (passeret 12. svangerskabsuge)",null,null,"§ 25, stk. 3, nr. 3",null,null,null,"Kr. pr. måned",null,11282]
["Under 30 år, psykisk syg, forsørgelsespligt",null,null,"§ 25, stk. 3, nr. 4",null,null,null,"Kr. pr. måned",null,14993]
["Under 30 år, psykisk syg, udeboende",null,null,"§ 25, stk. 3, nr. 5",null,null,null,"Kr. pr. måned",null,11282]
["25-29 år, udeboende",null,null,"§ 25, stk. 3, nr. 6",null,null,null,"Kr. pr. måned",null,7272]
["25-29 år, hjemmeboende",null,null,"§ 25, stk. 3, nr. 7",null,null,null,"Kr. pr. måned",null,3509]
["Under 25 år, udeboende",null,null,"§ 25, stk. 3, nr. 8",null,null,null,"Kr. pr. måned",null,7272]
["Under 25 år, hjemmeboende",null,null,"§ 25, stk. 3, nr. 9",null,null,null,"Kr. pr. måned",null,3509]
["Under 30 år, bidragspligt, maksimum hjælp inkl. tillæg",null,null,"§ 25, stk. 4",null,null,null,"Kr. pr. måned",null,14993]
["Aktivitetstillæg/Barselstillæg til kontanthjælp"]
["Enlige forsørgere under 30 år,",null,null,"§ 25, stk. 9, nr. 1",null,null,null,"Kr. pr. måned",null,662]
["Forsørgere under 30 år, som ikke har erhvervet ret til ekstra børnetilskud.",null,null,"§ 25, stk. 9, nr. 2",null,null,null,"Kr. pr. måned",null,4967]
["25-29 år, udeboende",null,null,"§ 25, stk. 9, nr. 3",null,null,null,"Kr. pr. måned",null,4011]
["25-29 år, hjemmeboende",null,null,"§ 25, stk. 9, nr. 4",null,null,null,"Kr. pr. måned",null,7774]
["Periodesanktioner – fradrag i kontanthjælp 12)"]
["Fyldt 30 år, forsørger børn",null,null,"§ 35, stk. 3",null,null,null,"Kr. pr. dag",null,692]
["Fyldt 30 år, andre",null,null,"§ 35, stk. 3",null,null,null,"Kr. pr. dag",null,521]
["Enlige forsørgere under 30 år",null,null,"§ 35, stk. 3",null,null,null,"Kr. pr. dag",null,661]
["Forsørgere under 30 år, som ikke har erhvervet ret til ekstra børnetilskud",null,null,"§ 35, stk. 3",null,null,null,"Kr. pr. dag",null,463]
["Under 30 år, gravid (passeret 12. svangerskabsuge)",null,null,"§ 35, stk. 3",null,null,null,"Kr. pr. dag",null,521]
["Under 30 år, psykisk syg, forsørgelsespligt",null,null,"§ 35, stk. 3",null,null,null,"Kr. pr. dag",null,692]
["Under 30 år, psykisk syg, udeboende",null,null,"§ 35, stk. 3",null,null,null,"Kr. pr. dag",null,521]
["25-29 år, udeboende",null,null,"§ 35, stk. 3",null,null,null,"Kr. pr. dag",null,336]
["25-29 år, hjemmeboende",null,null,"§ 35, stk. 3",null,null,null,"Kr. pr. dag",null,162]
["Under 25 år, udeboende",null,null,"§ 35, stk. 3",null,null,null,"Kr. pr. dag",null,336]
["Under 25 år, hjemmeboende",null,null,"§ 35, stk. 3",null,null,null,"Kr. pr. dag",null,162]
["Under 30 år, bidragspligt, maksimum hjælp inkl. tillæg",null,null,"§ 35, stk. 3",null,null,null,"Kr. pr. dag",null,692]
["Periodesanktioner – fradrag i aktivitetstillæg til kontanthjælp 12)"]
["Enlige forsørgere under 30 år",null,null,"§ 35, stk. 3",null,null,null,"Kr. pr. dag",null,31]
["Forsørger under 30 år, som ikke har erhvervet ret til ekstra børnetilskud.",null,null,"§ 35, stk. 3",null,null,null,"Kr. pr. dag",null,229]
["25-29 år, udeboende",null,null,"§ 35, stk. 3",null,null,null,"Kr. pr. dag",null,185]
["25-29 år, hjemmeboende",null,null,"§ 35, stk. 3",null,null,null,"Kr. pr. dag",null,359]
["Punktsanktioner – nedsættelse af kontanthjælp 12)"]
["Fyldt 30 år, forsørger børn",null,null,"§ 40, stk. 1",null,null,null,"Kr. pr. hændelse",null,2076]
["Fyldt 30 år, andre",null,null,"§ 40, stk. 1",null,null,null,"Kr. pr. hændelse",null,1563]
["Enlige forsørgere under 30 år",null,null,"§ 40, stk. 1",null,null,null,"Kr. pr. hændelse",null,1983]
["Forsørgere under 30 år, som ikke har erhvervet ret til ekstra børnetilskud.",null,null,"§ 40, stk. 1",null,null,null,"Kr. pr. hændelse",null,1389]
["Under 30 år, gravid (passeret 12. svangerskabsuge)",null,null,"§ 40, stk. 1",null,null,null,"Kr. pr. hændelse",null,1563]
["Under 30 år, psykisk syg, forsørgelsespligt",null,null,"§ 40, stk. 1",null,null,null,"Kr. pr. hændelse",null,2076]
["Under 30 år, psykisk syg, udeboende",null,null,"§ 40, stk. 1",null,null,null,"Kr. pr. hændelse",null,1563]
["25-29 år, udeboende",null,null,"§ 40, stk. 1",null,null,null,"Kr. pr. hændelse",null,1008]
["25-29 år, hjemmeboende",null,null,"§ 40, stk. 1",null,null,null,"Kr. pr. hændelse",null,486]
["Under 25 år, udeboende",null,null,"§ 40, stk. 1",null,null,null,"Kr. pr. hændelse",null,1008]
["Under 25 år, hjemmeboende",null,null,"§ 40, stk. 1",null,null,null,"Kr. pr. hændelse",null,486]
["Under 30 år, bidragspligt, maksimum hjælp inkl. tillæg",null,null,"§ 40, stk. 1",null,null,null,"Kr. pr. hændelse",null,2076]
["Punktsanktioner – nedsættelse i aktivitetstillæg til kontanthjælp 12)"]
["Enlige forsørgere under 30 år",null,null,"§ 40, stk. 1",null,null,null,"Kr. pr. hændelse",null,93]
["Forsørgere under 30 år, som ikke har erhvervet ret til ekstra børnetilskud",null,null,"§ 40, stk. 1",null,null,null,"Kr. pr. hændelse",null,687]
["25-29 år, udeboende",null,null,"§ 40, stk. 1",null,null,null,"Kr. pr. hændelse",null,555]
["25-29 år, hjemmeboende",null,null,"§ 40, stk. 1",null,null,null,"Kr. pr. hændelse",null,1077]
[]
["Uddannelseshjælp"]
["Enlige forsørgere under 30 år",null,null,"§ 23, stk. 2, nr. 1",null,null,null,"Kr. pr. måned",null,12364]
["Forsørgere under 30 år, som ikke har erhvervet ret til ekstra børnetilskud",null,null,"§ 23, stk. 2, nr. 2",null,null,null,"Kr. pr. måned",null,8653]
["Under 30 år, gravid (passeret 12. svangerskabsuge)",null,null,"§ 23, stk. 2, nr. 3",null,null,null,"Kr. pr. måned",null,11282]
["Under 30 år, psykisk syg, forsørgelsespligt",null,null,"§ 23, stk. 2, nr. 4",null,null,null,"Kr. pr. måned",null,14993]
["Under 30 år, psykisk syg, udeboende",null,null,"§ 23, stk. 2, nr. 5",null,null,null,"Kr. pr. måned",null,11282]
["25-29 år, udeboende",null,null,"§ 23, stk. 2, nr. 6",null,null,null,"Kr. pr. måned",null,6182]
["25-29 år, hjemmeboende",null,null,"§ 23, stk. 2, nr. 7",null,null,null,"Kr. pr. måned",null,2664]
["Under 25 år, udeboende",null,null,"§ 23, stk. 2, nr. 8",null,null,null,"Kr. pr. måned",null,6182]
["Under 25 år, hjemmeboende",null,null,"§ 23, stk. 2, nr. 9",null,null,null,"Kr. pr. måned",null,2664]
["Under 30 år, bidragspligt, maksimum hjælp inkl. tillæg",null,null,"§ 23, stk. 3",null,null,null,"Kr. pr. måned",null,14993]
["Aktivitetstillæg/Barselstillæg til uddannelseshjælp"]
["Enlige forsørgere under 30 år",null,null,"§ 24, stk. 3, nr. 1",null,null,null,"Kr. pr. måned",null,2629]
["Forsørgere under 30 år, som ikke har erhvervet ret til ekstra børnetilskud.",null,null,"§ 24, stk. 3, nr. 2",null,null,null,"Kr. pr. måned",null,6341]
["25-29 år, udeboende",null,null,"§ 24, stk. 3, nr. 3",null,null,null,"Kr. pr. måned",null,5100]
["25-29 år, hjemmeboende",null,null,"§ 24, stk. 3, nr. 4",null,null,null,"Kr. pr. måned",null,8618]
["Under 25 år, udeboende",null,null,"§ 24, stk. 3, nr. 5",null,null,null,"Kr. pr. måned",null,1089]
["Under 25 år, hjemmeboende",null,null,"§ 24, stk. 3, nr. 6",null,null,null,"Kr. pr. måned",null,844]
["Periodesanktioner – fradrag i uddannelseshjælp 12)"]
["Enlige forsørgere under 30 år",null,null,"§ 35, stk. 3",null,null,null,"Kr. pr. dag",null,571]
["Forsørgere under 30 år, som ikke har erhvervet ret til ekstra børnetilskud",null,null,"§ 35, stk. 3",null,null,null,"Kr. pr. dag",null,399]
["Under 30 år, gravid (passeret 12. svangerskabsuge)",null,null,"§ 35, stk. 3",null,null,null,"Kr. pr. dag",null,521]
["Under 30 år, psykisk syg, forsørgelsespligt",null,null,"§ 35, stk. 3",null,null,null,"Kr. pr. dag",null,692]
["Under 30 år, psykisk syg, udeboende",null,null,"§ 35, stk. 3",null,null,null,"Kr. pr. dag",null,521]
["25-29 år, udeboende",null,null,"§ 35, stk. 3",null,null,null,"Kr. pr. dag",null,285]
["25-29 år, hjemmeboende",null,null,"§ 35, stk. 3",null,null,null,"Kr. pr. dag",null,123]
["Under 25 år, udeboende",null,null,"§ 35, stk. 3",null,null,null,"Kr. pr. dag",null,285]
["Under 25 år, hjemmeboende",null,null,"§ 35, stk. 3",null,null,null,"Kr. pr. dag",null,123]
["Under 30 år, bidragspligt, maksimum hjælp inkl. tillæg",null,null,"§ 35, stk. 3",null,null,null,"Kr. pr. dag",null,692]
["Periodesanktioner – fradrag i aktivitetstillæg til uddannelseshjælp 12)"]
["Enlige forsørgere under 30 år",null,null,"§ 35, stk. 3",null,null,null,"Kr. pr. dag",null,121]
["Forsørgere under 30 år, som ikke har erhvervet ret til ekstra børnetilskud",null,null,"§ 35, stk. 3",null,null,null,"Kr. pr. dag",null,293]
["25-29 år, udeboende",null,null,"§ 35, stk. 3",null,null,null,"Kr. pr. dag",null,235]
["25-29 år, hjemmeboende",null,null,"§ 35, stk. 3",null,null,null,"Kr. pr. dag",null,398]
["Under 25 år, udeboende",null,null,"§ 35, stk. 3",null,null,null,"Kr. pr. dag",null,50]
["Under 25 år, hjemmeboende",null,null,"§ 35, stk. 3",null,null,null,"Kr. pr. dag",null,39]
["Punktsanktioner – nedsættelse af uddannelseshjælp 12)"]
["Enlige forsørgere under 30 år",null,null,"§ 40, stk. 1",null,null,null,"Kr. pr. hændelse",null,1713]
["Forsørgere under 30 år, som ikke har erhvervet ret til ekstra børnetilskud",null,null,"§ 40, stk. 1",null,null,null,"Kr. pr. hændelse",null,1197]
["Under 30 år, gravid (passeret 12. svangerskabsuge)",null,null,"§ 40, stk. 1",null,null,null,"Kr. pr. hændelse",null,1563]
["Under 30 år, psykisk syg, forsørgelsespligt",null,null,"§ 40, stk. 1",null,null,null,"Kr. pr. hændelse",null,2076]
["Under 30 år, psykisk syg, udeboende",null,null,"§ 40, stk. 1",null,null,null,"Kr. pr. hændelse",null,1563]
["25-29 år, udeboende",null,null,"§ 40, stk. 1",null,null,null,"Kr. pr. hændelse",null,855]
["25-29 år, hjemmeboende",null,null,"§ 40, stk. 1",null,null,null,"Kr. pr. hændelse",null,369]
["Under 25 år, udeboende",null,null,"§ 40, stk. 1",null,null,null,"Kr. pr. hændelse",null,855]
["Under 25 år, hjemmeboende",null,null,"§ 40, stk. 1",null,null,null,"Kr. pr. hændelse",null,369]
["Under 30 år, bidragspligt, maksimum hjælp inkl. tillæg",null,null,"§ 40, stk. 1",null,null,null,"Kr. pr. hændelse",null,2076]
["Punktsanktioner – nedsættelse af aktivitetstillæg til uddannelseshjælp 12)"]
["Enlige forsørgere under 30 år",null,null,"§ 40, stk. 1",null,null,null,"Kr. pr. hændelse",null,363]
["Forsørgere under 30 år, som ikke har erhvervet ret til ekstra børnetilskud",null,null,"§ 40, stk. 1",null,null,null,"Kr. pr. hændelse",null,879]
["25-29 år, udeboende",null,null,"§ 40, stk. 1",null,null,null,"Kr. pr. hændelse",null,705]
["25-29 år, hjemmeboende",null,null,"§ 40, stk. 1",null,null,null,"Kr. pr. hændelse",null,1194]
["Under 25 år, udeboende",null,null,"§ 40, stk. 1",null,null,null,"Kr. pr. hændelse",null,150]
["Under 25 år, hjemmeboende",null,null,"§ 40, stk. 1",null,null,null,"Kr. pr. hændelse",null,117]
["Kontanthjælpsloft for modtagere af hjælp efter §§ 23-25 med et beløb svarende til satserne i § 25, stk. 2"]
["Gifte/samlevende, forsørgere",null,null,"§ 25 b, stk. 1, nr. 1",null,null,null,"Kr. pr. måned",null,14993]
["Gifte/samlevende, ikke forsørgere",null,null,"§ 25 b, stk. 1, nr. 2",null,null,null,"Kr. pr. måned",null,11282]
["Enlige, forsørger, 1 barn",null,null,"§ 25 b, stk. 1, nr. 3",null,null,null,"Kr. pr. måned",null,15632]
["Enlige, forsørger, 2 eller flere børn",null,null,"§ 25 b, stk. 1, nr. 4",null,null,null,"Kr. pr. måned",null,16001]
["Enlige, ikke forsørger",null,null,"§ 25 b, stk. 1, nr. 5",null,null,null,"Kr. pr. måned",null,13645]
["Kontanthjælpsloft for modtagere af hjælp efter § 25, stk. 3, og som ikke er omfattet af § 25 b, stk. 1"]
["Gifte/samlevende, forsørgere, 1 barn",null,null,"§ 25 b, stk. 2, nr. 1",null,null,null,"Kr. pr. måned",null,12801]
["Gifte/samlevende, forsørgere, 2 eller flere børn",null,null,"§ 25 b, stk. 2, nr. 2",null,null,null,"Kr. pr. måned",null,12674]
["Gifte/samlevende, ikke forsørgere",null,null,"§ 25 b, stk. 2, nr. 3",null,null,null,"Kr. pr. måned",null,9723]
["Enlige, forsørger, 1 barn",null,null,"§ 25 b, stk. 2, nr. 4",null,null,null,"Kr. pr. måned",null,15323]
["Enlige, forsørger, 2 eller flere børn",null,null,"§ 25 b, stk. 2, nr. 5",null,null,null,"Kr. pr. måned",null,15692]
["Enlige, ikke forsørger",null,null,"§ 25 b, stk. 2, nr. 6",null,null,null,"Kr. pr. måned",null,10445]
["Kontanthjælpsloft for modtagere af hjælp efter §§ 22-24, eller som får beregnet hjælp efter § 26, stk. 2, og som ikke er omfattet af § 25 b, stk.1"]
["Gifte/samlevende, forsørgere, 1 barn",null,null,"§ 25 b, stk. 3, nr. 1",null,null,null,"Kr. pr. måned",null,12208]
["Gifte/samlevende, forsørgere, 2 eller flere børn",null,null,"§ 25 b, stk. 3, nr. 2",null,null,null,"Kr. pr. måned",null,12043]
["Gifte/samlevende, ikke forsørgere",null,null,"§ 25 b, stk. 3, nr. 3",null,null,null,"Kr. pr. måned",null,9317]
["Enlige, forsørger, 1 barn",null,null,"§ 25 b, stk. 3, nr. 4",null,null,null,"Kr. pr. måned",null,14579]
["Enlige, forsørger, 2 eller flere børn",null,null,"§ 25 b, stk. 3, nr. 5",null,null,null,"Kr. pr. måned",null,14947]
["Enlige, ikke forsørger",null,null,"§ 25 b, stk. 3, nr. 6",null,null,null,"Kr. pr. måned",null,10034]
["Kontanthjælpsloft for ægtefæller, hvor en eller begge modtager integrationsydelse, og som ikke opfylder 225 timers kravet (Ægtefæller omfattet af § 13 f, stk. 3 og 4)"]
["Ej nedsat hjælp, forsørger, 1 barn",null,null,"§ 25 b, stk. 4, nr. 1",null,null,null,"Kr. pr. måned",null,9347]
["Ej nedsat hjælp, forsørger, 2 eller flere børn",null,null,"§ 25 b, stk. 4, nr. 2",null,null,null,"Kr. pr. måned",null,9416]
["Ej nedsat hjælp, ikke forsørger",null,null,"§ 25 b, stk. 4, nr. 3",null,null,null,"Kr. pr. måned",null,6294]
["Nedsat hjælp, forsørger, 1 barn",null,null,"§ 25 b, stk. 4, nr. 4",null,null,null,"Kr. pr. måned",null,7062]
["Nedsat hjælp, forsørger, 2 eller flere børn",null,null,"§ 25 b, stk. 4, nr. 5",null,null,null,"Kr. pr. måned",null,7131]
["Nedsat hjælp, ikke forsørger",null,null,"§ 25 b, stk. 4, nr. 6",null,null,null,"Kr. pr. måned",null,5222]
["Nedsættelse af hjælpen til ugifte personer, der ikke opfylder kravet om 225 timers ordinært og ustøttet arbejde inden for de seneste 12 kalendermåneder"]
["Hjælp beregnet på baggrund af 14.993 kr./11.282 kr. pr. måned",null,null,"§ 13 g, stk. 1, nr. 1",null,null,null,"Kr. pr. måned",null,1029]
["Hjælp beregnet på baggrund af mindre end 14.993 kr./11.282 kr. pr. måned",null,null,"§ 13 g, stk. 1, nr. 2",null,null,null,"Kr. pr. måned",null,514]
["Omregningssats for ukendt arbejdstid til 225 timers-regel"]
["Omregningssats",null,null,"§ 13 f, stk. 15",null,null,null,"Kr. pr. time",null,122.5]
["Ægtefælleberegning – 225 timers-regel"]
["Forsørgere",null,null,"§ 26, stk. 5-8",null,null,null,"Kr. pr. måned",null,14993]
["Ikke-forsørgere",null,null,"§ 26, stk. 5-8",null,null,null,"Kr. pr. måned",null,11282]
["Engangshjælp"]
["Over 25 år, samt udeboende under 25 år (maksimum)",null,null,"§ 25 a, stk. 2",null,null,null,"Kr. pr. måned",null,6030]
["Hjemmeboende under 25 år (maksimum)",null,null,"§ 25 a, stk. 3",null,null,null,"Kr. pr. måned",null,2998]
["Hjælp til visse persongrupper"]
["Nået efterlønsalderen, ikke optjent pensionsret",null,null,"§ 27, stk. 1",null,null,null,"Kr. pr. måned",null,9570]
["Børnestøttebeløb, ikke optjent pensionsret",null,null,"§ 27, stk. 2",null,null,null,"Kr. pr. måned",null,3032]
["Enlige forsørgere – under 30 år (maksimum)",null,null,"§ 12, stk. 3",null,null,null,"Kr. pr. måned",null,12364]
["Fradrag ved formue og indtægt, beløb der ses bort fra"]
["Formue, enlige",null,null,"§ 14, stk. 1",null,null,null,"Kr. pr. måned",null,10000]
["Formue, ægtefæller",null,null,"§ 14, stk. 1",null,null,null,"Kr. pr. måned",null,20000]
["Formue, engangsbeløb fra forsikring ved kritisk sygdom",null,null,"§ 14, stk. 8",null,null,null,"Kr. pr. forsikringsbegivenhed",null,150000]
["Forsørgelsesydelse, ægtefæller, forsørgelsespligt",null,null,"§ 30, stk. 2",null,null,null,"Kr. pr. måned",null,14993]
["Forsørgelsesydelse, ægtefæller, andre",null,null,"§ 30, stk. 2",null,null,null,"Kr. pr. måned",null,11282]
["Fradrag pr. arbejdstime ved arbejdsindtægt",null,null,"§ 31, stk. 1",null,null,null,"Kr. pr. time",null,26.78]
["Fradrag for indtægter ved arbejde - STU (maksimumbeløb)",null,null,"§ 31, stk. 2",null,null,null,"Kr. pr. år",null,25319]
["Arbejdstillæg, ukendt arbejdstimer, omregningssats",null,null,"§ 31, stk. 3",null,null,null,"Kr. pr. time",null,235.6]
["Særlig støtte, grænsebeløb, boligudgift 13)"]
["Ikke-forsørgere",null,null,"§ 34, stk. 8",null,null,null,"Kr. pr. måned",null,3000]
["Forsørgere med et hjemmeboende barn",null,null,"§ 34, stk. 8",null,null,null,"Kr. pr. måned",null,4300]
["Forsørgere med et udeboende barn",null,null,"§ 34, stk. 8",null,null,null,"Kr. pr. måned",null,4400]
["Fradrag i grænsebeløbet pr. barn hjemme udover 1",null,null,"§ 34, stk. 8",null,null,null,"Kr. pr. måned",null,800]
["Fradrag i grænsebeløbet pr. barn ude udover 1",null,null,"§ 34, stk. 8",null,null,null,"Kr. pr. måned",null,650]
["Indtægtsgrænse efter 3 måneder - dagpengemaksimum",null,null,"§ 34, stk. 8",null,null,null,"Kr. pr. måned",null,18633]
["Grænse uafhængig af tidligere indtægter - integrationsydelse",null,null,"§ 34, stk. 8",null,null,null,"Kr. pr. måned",null,13233]
["Fradrag for forskudsvis udlagt børnebidrag"]
["Samlede udbetalt beløb (minimumsbeløb)",null,null,"§ 96 a, stk. 1",null,null,null,"Kr. pr. måned",null,14993]
["12) Bestemmelserne under ”Sanktioner” henviser til sanktionsbestemmelserne i §§ 35-41 i LBK nr. 269 af 21. marts 2017 af lov om aktiv socialpolitik med senere ændringer og vejledning nr. 10013 af 13. oktober 2016 om rådighed og sanktioner for personer, der ansøger om eller modtager integrationsydelse, uddannelseshjælp eller kontanthjælp."]
["13) Jf. BEK nr. 894 af 29. juni 2017 om særlig støtte efter § 34 i lov om aktiv socialpolitik."]

{"sheet":"2017 sats","index":13,"n_rows":174,"n_cols":10,"rows_kept":174,"cut":false,"hidden":false,"merged":[[0,0,0,11],[1,0,1,2],[1,3,1,6],[1,7,1,8],[1,9,1,11],[2,0,2,11],[5,0,5,2],[5,3,5,6],[5,7,5,8],[5,9,5,11],[6,0,6,2],[6,3,6,6],[6,7,6,8],[6,9,6,11],[3,0,3,2],[3,3,3,6],[3,7,3,8],[3,9,3,11],[4,0,4,2],[4,3,4,6],[4,7,4,8],[4,9,4,11],[9,0,9,2],[9,3,9,6],[9,7,9,8],[9,9,9,11],[10,0,10,2],[10,3,10,6],[10,7,10,8],[10,9,10,11],[7,0,7,2],[7,3,7,6],[7,7,7,8],[7,9,7,11],[8,0,8,2],[8,3,8,6],[8,7,8,8],[8,9,8,11],[13,0,13,2],[13,3,13,6],[13,7,13,8],[13,9,13,11],[14,0,14,2],[14,3,14,6],[14,7,14,8],[14,9,14,11],[11,0,11,2],[11,3,11,6],[11,7,11,8],[11,9,11,11],[12,0,12,2],[12,3,12,6],[12,7,12,8],[12,9,12,11],[15,0,15,11],[16,0,16,2],[16,3,16,6],[16,7,16,8],[16,9,16,11],[17,0,17,2],[17,3,17,6],[17,7,17,8],[17,9,17,11],[20,0,20,3],[20,4,20,11],[21,0,21,2],[21,3,21,6],[21,7,21,8],[21,9,21,11],[18,0,18,2],[18,3,18,6],[18,7,18,8],[18,9,18,11],[19,0,19,2],[19,3,19,6],[19,7,19,8],[19,9,19,11],[24,0,24,2],[24,3,24,6],[24,7,24,8],[24,9,24,11],[25,0,25,2],[25,3,25,6],[25,7,25,8],[25,9,25,11],[22,0,22,2],[22,3,22,6],[22,7,22,8],[22,9,22,11],[23,0,23,2],[23,3,23,6],[23,7,23,8],[23,9,23,11],[28,0,28,2],[28,3,28,6],[28,7,28,8],[28,9,28,11],[29,0,29,2],[29,3,29,6],[29,7,29,8],[29,9,29,11],[26,0,26,2],[26,3,26,6],[26,7,26,8],[26,9,26,11],[27,0,27,2],[27,3,27,6],[27,7,27,8],[27,9,27,11],[32,0,32,2],[32,3,32,6],[32,7,32,8],[32,9,32,11],[33,0,33,2],[33,3,33,6],[33,7,33,8],[33,9,33,11],[30,0,30,2],[30,3,30,6],[30,7,30,8],[30,9,30,11],[31,0,31,2],[31,3,31,6],[31,7,31,8],[31,9,31,11],[36,0,36,2],[36,3,36,6],[36,7,36,8],[36,9,36,11],[37,0,37,2],[37,3,37,6],[37,7,37,8],[37,9,37,11],[34,0,34,2],[34,3,34,6],[34,7,34,8],[34,9,34,11],[35,0,35,2],[35,3,35,6],[35,7,35,8],[35,9,35,11],[40,0,40,2],[40,3,40,6],[40,7,40,8],[40,9,40,11],[41,0,41,2],[41,3,41,6],[41,7,41,8],[41,9,41,11],[38,0,38,2],[38,3,38,6],[38,7,38,8],[38,9,38,11],[39,0,39,2],[39,3,39,6],[39,7,39,8],[39,9,39,11],[44,0,44,2],[44,3,44,6],[44,7,44,8],[44,9,44,11],[45,0,45,2],[45,3,45,6],[45,7,45,8],[45,9,45,11],[42,0,42,2],[42,3,42,6],[42,7,42,8],[42,9,42,11],[43,0,43,2],[43,3,43,6],[43,7,43,8],[43,9,43,11],[48,0,48,2],[48,3,48,6],[48,7,48,8],[48,9,48,11],[49,0,49,2],[49,3,49,6],[49,7,49,8],[49,9,49,11],[46,0,46,2],[46,3,46,6],[46,7,46,8],[46,9,46,11],[47,0,47,2],[47,3,47,6],[47,7,47,8],[47,9,47,11],[52,0,52,2],[52,3,52,6],[52,7,52,8],[52,9,52,11],[53,0,53,2],[53,3,53,6],[53,7,53,8],[53,9,53,11],[50,0,50,2],[50,3,50,6],[50,7,50,8],[50,9,50,11],[51,0,51,2],[51,3,51,6],[51,7,51,8],[51,9,51,11],[56,0,56,2],[56,3,56,6],[56,7,56,8],[56,9,56,11],[57,0,57,2],[57,3,57,6],[57,7,57,8],[57,9,57,11],[54,0,54,2],[54,3,54,6],[54,7,54,8],[54,9,54,11],[55,0,55,2],[55,3,55,6],[55,7,55,8],[55,9,55,11],[60,0,60,2],[60,3,60,6],[60,7,60,8],[60,9,60,11],[61,0,61,2],[61,3,61,6],[61,7,61,8],[61,9,61,11],[58,0,58,2],[58,3,58,6],[58,7,58,8],[58,9,58,11],[59,0,59,2],[59,3,59,6],[59,7,59,8],[59,9,59,11],[64,0,64,2],[64,3,64,6],[64,7,64,8],[64,9,64,11],[65,0,65,2],[65,3,65,6],[65,7,65,8],[65,9,65,11],[62,0,62,2],[62,3,62,6],[62,7,62,8],[62,9,62,11],[63,0,63,2],[63,3,63,6],[63,7,63,8],[63,9,63,11],[68,0,68,2],[68,3,68,6],[68,7,68,8],[68,9,68,11],[69,0,69,2],[69,3,69,6],[69,7,69,8],[69,9,69,11],[66,0,66,2],[66,3,66,6],[66,7,66,8],[66,9,66,11],[67,0,67,2],[67,3,67,6],[67,7,67,8],[67,9,67,11],[72,0,72,2],[72,3,72,6],[72,7,72,8],[72,9,72,11],[73,0,73,2],[73,3,73,6],[73,7,73,8],[73,9,73,11],[70,0,70,2],[70,3,70,6],[70,7,70,8],[70,9,70,11],[71,0,71,2],[71,3,71,6],[71,7,71,8],[71,9,71,11],[76,0,76,2],[76,3,76,6],[76,7,76,8],[76,9,76,11],[77,0,77,2],[77,3,77,6],[77,7,77,8],[77,9,77,11],[74,0,74,2],[74,3,74,6],[74,7,74,8],[74,9,74,11],[75,0,75,2],[75,3,75,6],[75,7,75,8],[75,9,75,11],[80,0,80,2],[80,3,80,6],[80,7,80,8],[80,9,80,11],[81,0,81,2],[81,3,81,6],[81,7,81,8],[81,9,81,11],[78,0,78,2],[78,3,78,6],[78,7,78,8],[78,9,78,11],[79,0,79,2],[79,3,79,6],[79,7,79,8],[79,9,79,11],[84,0,84,2],[84,3,84,6],[84,7,84,8],[84,9,84,11],[85,0,85,2],[85,3,85,6],[85,7,85,8],[85,9,85,11],[82,0,82,2],[82,3,82,6],[82,7,82,8],[82,9,82,11],[83,0,83,2],[83,3,83,6],[83,7,83,8],[83,9,83,11],[88,0,88,2],[88,3,88,6],[88,7,88,8],[88,9,88,11],[89,0,89,2],[89,3,89,6],[89,7,89,8],[89,9,89,11],[86,0,86,2],[86,3,86,6],[86,7,86,8],[86,9,86,11],[87,0,87,2],[87,3,87,6],[87,7,87,8],[87,9,87,11],[92,0,92,2],[92,3,92,6],[92,7,92,8],[92,9,92,11],[93,0,93,2],[93,3,93,6],[93,7,93,8],[93,9,93,11],[90,0,90,2],[90,3,90,6],[90,7,90,8],[90,9,90,11],[91,0,91,2],[91,3,91,6],[91,7,91,8],[91,9,91,11],[96,0,96,2],[96,3,96,6],[96,7,96,8],[96,9,96,11],[97,0,97,2],[97,3,97,6],[97,7,97,8],[97,9,97,11],[94,0,94,2],[94,3,94,6],[94,7,94,8],[94,9,94,11],[95,0,95,2],[95,3,95,6],[95,7,95,8],[95,9,95,11],[100,0,100,2],[100,3,100,6],[100,7,100,8],[100,9,100,11],[101,0,101,2],[101,3,101,6],[101,7,101,8],[101,9,101,11],[98,0,98,2],[98,3,98,6],[98,7,98,8],[98,9,98,11],[99,0,99,2],[99,3,99,6],[99,7,99,8],[99,9,99,11],[104,0,104,2],[104,3,104,6],[104,7,104,8],[104,9,104,11],[105,0,105,2],[105,3,105,6],[105,7,105,8],[105,9,105,11],[102,0,102,2],[102,3,102,6],[102,7,102,8],[102,9,102,11],[103,0,103,2],[103,3,103,6],[103,7,103,8],[103,9,103,11],[108,0,108,2],[108,3,108,6],[108,7,108,8],[108,9,108,11],[109,0,109,2],[109,3,109,6],[109,7,109,8],[109,9,109,11],[106,0,106,2],[106,3,106,6],[106,7,106,8],[106,9,106,11],[107,0,107,2],[107,3,107,6],[107,7,107,8],[107,9,107,11],[112,0,112,2],[112,3,112,6],[112,7,112,8],[112,9,112,11],[113,0,113,2],[113,3,113,6],[113,7,113,8],[113,9,113,11],[110,0,110,2],[110,3,110,6],[110,7,110,8],[110,9,110,11],[111,0,111,2],[111,3,111,6],[111,7,111,8],[111,9,111,11],[116,0,116,2],[116,3,116,6],[116,7,116,8],[116,9,116,11],[117,0,117,2],[117,3,117,6],[117,7,117,8],[117,9,117,11],[114,0,114,2],[114,3,114,6],[114,7,114,8],[114,9,114,11],[115,0,115,2],[115,3,115,6],[115,7,115,8],[115,9,115,11],[120,0,120,2],[120,3,120,6],[120,7,120,8],[120,9,120,11],[121,0,121,2],[121,3,121,6],[121,7,121,8],[121,9,121,11],[118,0,118,2],[118,3,118,6],[118,7,118,8],[118,9,118,11],[119,0,119,2],[119,3,119,6],[119,7,119,8],[119,9,119,11],[124,0,124,2],[124,3,124,6],[124,7,124,8],[124,9,124,11],[125,0,125,2],[125,3,125,6],[125,7,125,8],[125,9,125,11],[122,0,122,2],[122,3,122,6],[122,7,122,8],[122,9,122,11],[123,0,123,2],[123,3,123,6],[123,7,123,8],[123,9,123,11],[128,0,128,2],[128,3,128,6],[128,7,128,8],[128,9,128,11],[129,0,129,2],[129,3,129,6],[129,7,129,8],[129,9,129,11],[126,0,126,2],[126,3,126,6],[126,7,126,8],[126,9,126,11],[127,0,127,2],[127,3,127,6],[127,7,127,8],[127,9,127,11],[132,0,132,2],[132,3,132,6],[132,7,132,8],[132,9,132,11],[133,0,133,2],[133,3,133,6],[133,7,133,8],[133,9,133,11],[130,0,130,2],[130,3,130,6],[130,7,130,8],[130,9,130,11],[131,0,131,2],[131,3,131,6],[131,7,131,8],[131,9,131,11],[136,0,136,2],[136,3,136,6],[136,7,136,8],[136,9,136,11],[137,0,137,2],[137,3,137,6],[137,7,137,8],[137,9,137,11],[134,0,134,2],[134,3,134,6],[134,7,134,8],[134,9,134,11],[135,0,135,2],[135,3,135,6],[135,7,135,8],[135,9,135,11],[140,0,140,2],[140,3,140,6],[140,7,140,8],[140,9,140,11],[141,0,141,2],[141,3,141,6],[141,7,141,8],[141,9,141,11],[138,0,138,2],[138,3,138,6],[138,7,138,8],[138,9,138,11],[139,0,139,2],[139,3,139,6],[139,7,139,8],[139,9,139,11],[144,0,144,2],[144,3,144,6],[144,7,144,8],[144,9,144,11],[145,0,145,2],[145,3,145,6],[145,7,145,8],[145,9,145,11],[142,0,142,2],[142,3,142,6],[142,7,142,8],[142,9,142,11],[143,0,143,2],[143,3,143,6],[143,7,143,8],[143,9,143,11],[148,0,148,2],[148,3,148,6],[148,7,148,8],[148,9,148,11],[149,0,149,2],[149,3,149,6],[149,7,149,8],[149,9,149,11],[146,0,146,2],[146,3,146,6],[146,7,146,8],[146,9,146,11],[147,0,147,2],[147,3,147,6],[147,7,147,8],[147,9,147,11],[152,0,152,2],[152,3,152,6],[152,7,152,8],[152,9,152,11],[153,0,153,2],[153,3,153,6],[153,7,153,8],[153,9,153,11],[150,0,150,2],[150,3,150,6],[150,7,150,8],[150,9,150,11],[151,0,151,2],[151,3,151,6],[151,7,151,8],[151,9,151,11],[156,0,156,2],[156,3,156,6],[156,7,156,8],[156,9,156,11],[157,0,157,2],[157,3,157,6],[157,7,157,8],[157,9,157,11],[154,0,154,2],[154,3,154,6],[154,7,154,8],[154,9,154,11],[155,0,155,2],[155,3,155,6],[155,7,155,8],[155,9,155,11],[160,0,160,2],[160,3,160,6],[160,7,160,8],[160,9,160,11],[161,0,161,2],[161,3,161,6],[161,7,161,8],[161,9,161,11],[158,0,158,2],[158,3,158,6],[158,7,158,8],[158,9,158,11],[159,0,159,2],[159,3,159,6],[159,7,159,8],[159,9,159,11],[164,0,164,2],[164,3,164,6],[164,7,164,8],[164,9,164,11],[165,0,165,2],[165,3,165,6],[165,7,165,8],[165,9,165,11],[162,0,162,2],[162,3,162,6],[162,7,162,8],[162,9,162,11],[163,0,163,2],[163,3,163,6],[163,7,163,8],[163,9,163,11],[168,0,168,2],[168,3,168,6],[168,7,168,8],[168,9,168,11],[169,0,169,2],[169,3,169,6],[169,7,169,8],[169,9,169,11],[166,0,166,2],[166,3,166,6],[166,7,166,8],[166,9,166,11],[167,0,167,2],[167,3,167,6],[167,7,167,8],[167,9,167,11],[172,0,172,11],[173,0,173,11],[174,0,174,11],[170,0,170,2],[170,3,170,6],[170,7,170,8],[170,9,170,11],[171,0,171,2],[171,3,171,6],[171,7,171,8],[171,9,171,11]]}
["Tabel 5. Kontanthjælp og uddannelseshjælp, jf. lov om aktiv socialpolitik (LBK nr. 468 af 20. maj 2016)"]
[null,null,null,"Lovhenvisning",null,null,null,"Enhed",null,"Sats"]
["Kontanthjælp"]
["Fyldt 30 år, forsørger børn",null,null,"§ 25, stk. 2, nr. 1",null,null,null,"Kr. pr. måned",null,14808]
["Fyldt 30 år, andre",null,null,"§ 25, stk. 2, nr. 2",null,null,null,"Kr. pr. måned",null,11143]
["Enlige forsørgere under 30 år",null,null,"§ 25, stk. 3, nr. 1",null,null,null,"Kr. pr. måned",null,14154]
["Forsørgere under 30 år, som ikke har erhvervet ret til ekstra børnetilskud",null,null,"§ 25, stk. 3, nr. 2",null,null,null,"Kr. pr. måned",null,9902]
["Under 30 år, gravid (passeret 12. svangerskabsuge)",null,null,"§ 25, stk. 3, nr. 3",null,null,null,"Kr. pr. måned",null,11143]
["Under 30 år, psykisk syg, forsørgelsespligt",null,null,"§ 25, stk. 3, nr. 4",null,null,null,"Kr. pr. måned",null,14808]
["Under 30 år, psykisk syg, udeboende",null,null,"§ 25, stk. 3, nr. 5",null,null,null,"Kr. pr. måned",null,11143]
["25-29 år, udeboende",null,null,"§ 25, stk. 3, nr. 6",null,null,null,"Kr. pr. måned",null,7182]
["25-29 år, hjemmeboende",null,null,"§ 25, stk. 3, nr. 7",null,null,null,"Kr. pr. måned",null,3466]
["Under 25 år, udeboende",null,null,"§ 25, stk. 3, nr. 8",null,null,null,"Kr. pr. måned",null,7182]
["Under 25 år, hjemmeboende",null,null,"§ 25, stk. 3, nr. 9",null,null,null,"Kr. pr. måned",null,3466]
["Under 30 år, bidragspligt, maksimum hjælp inkl. tillæg",null,null,"§ 25, stk. 4",null,null,null,"Kr. pr. måned",null,14808]
["Aktivitetstillæg/Barselstillæg til kontanthjælp"]
["Enlige forsørgere under 30 år,",null,null,"§ 25, stk. 9, nr. 1",null,null,null,"Kr. pr. måned",null,654]
["Forsørgere under 30 år, som ikke har erhvervet ret til ekstra børnetilskud.",null,null,"§ 25, stk. 9, nr. 2",null,null,null,"Kr. pr. måned",null,4906]
["25-29 år, udeboende",null,null,"§ 25, stk. 9, nr. 3",null,null,null,"Kr. pr. måned",null,3961]
["25-29 år, hjemmeboende",null,null,"§ 25, stk. 9, nr. 4",null,null,null,"Kr. pr. måned",null,7678]
["Periodesanktioner – fradrag i kontanthjælp 10)"]
["Fyldt 30 år, forsørger børn",null,null,"§ 35, stk. 3",null,null,null,"Kr. pr. dag",null,683]
["Fyldt 30 år, andre",null,null,"§ 35, stk. 3",null,null,null,"Kr. pr. dag",null,514]
["Enlige forsørgere under 30 år",null,null,"§ 35, stk. 3",null,null,null,"Kr. pr. dag",null,653]
["Forsørgere under 30 år, som ikke har erhvervet ret til ekstra børnetilskud",null,null,"§ 35, stk. 3",null,null,null,"Kr. pr. dag",null,457]
["Under 30 år, gravid (passeret 12. svangerskabsuge)",null,null,"§ 35, stk. 3",null,null,null,"Kr. pr. dag",null,514]
["Under 30 år, psykisk syg, forsørgelsespligt",null,null,"§ 35, stk. 3",null,null,null,"Kr. pr. dag",null,683]
["Under 30 år, psykisk syg, udeboende",null,null,"§ 35, stk. 3",null,null,null,"Kr. pr. dag",null,514]
["25-29 år, udeboende",null,null,"§ 35, stk. 3",null,null,null,"Kr. pr. dag",null,331]
["25-29 år, hjemmeboende",null,null,"§ 35, stk. 3",null,null,null,"Kr. pr. dag",null,160]
["Under 25 år, udeboende",null,null,"§ 35, stk. 3",null,null,null,"Kr. pr. dag",null,331]
["Under 25 år, hjemmeboende",null,null,"§ 35, stk. 3",null,null,null,"Kr. pr. dag",null,160]
["Under 30 år, bidragspligt, maksimum hjælp inkl. tillæg",null,null,"§ 35, stk. 3",null,null,null,"Kr. pr. dag",null,683]
["Periodesanktioner – fradrag i aktivitetstillæg til kontanthjælp 10)"]
["Enlige forsørgere under 30 år",null,null,"§ 35, stk. 3",null,null,null,"Kr. pr. dag",null,30]
["Forsørger under 30 år, som ikke har erhvervet ret til ekstra børnetilskud.",null,null,"§ 35, stk. 3",null,null,null,"Kr. pr. dag",null,226]
["25-29 år, udeboende",null,null,"§ 35, stk. 3",null,null,null,"Kr. pr. dag",null,183]
["25-29 år, hjemmeboende",null,null,"§ 35, stk. 3",null,null,null,"Kr. pr. dag",null,354]
["Punktsanktioner – nedsættelse af kontanthjælp 10)"]
["Fyldt 30 år, forsørger børn",null,null,"§ 40, stk. 1",null,null,null,"Kr. pr. hændelse",null,2049]
["Fyldt 30 år, andre",null,null,"§ 40, stk. 1",null,null,null,"Kr. pr. hændelse",null,1542]
["Enlige forsørgere under 30 år",null,null,"§ 40, stk. 1",null,null,null,"Kr. pr. hændelse",null,1959]
["Forsørgere under 30 år, som ikke har erhvervet ret til ekstra børnetilskud.",null,null,"§ 40, stk. 1",null,null,null,"Kr. pr. hændelse",null,1371]
["Under 30 år, gravid (passeret 12. svangerskabsuge)",null,null,"§ 40, stk. 1",null,null,null,"Kr. pr. hændelse",null,1542]
["Under 30 år, psykisk syg, forsørgelsespligt",null,null,"§ 40, stk. 1",null,null,null,"Kr. pr. hændelse",null,2049]
["Under 30 år, psykisk syg, udeboende",null,null,"§ 40, stk. 1",null,null,null,"Kr. pr. hændelse",null,1542]
["25-29 år, udeboende",null,null,"§ 40, stk. 1",null,null,null,"Kr. pr. hændelse",null,993]
["25-29 år, hjemmeboende",null,null,"§ 40, stk. 1",null,null,null,"Kr. pr. hændelse",null,480]
["Under 25 år, udeboende",null,null,"§ 40, stk. 1",null,null,null,"Kr. pr. hændelse",null,993]
["Under 25 år, hjemmeboende",null,null,"§ 40, stk. 1",null,null,null,"Kr. pr. hændelse",null,480]
["Under 30 år, bidragspligt, maksimum hjælp inkl. tillæg",null,null,"§ 40, stk. 1",null,null,null,"Kr. pr. hændelse",null,2049]
["Punktsanktioner – nedsættelse i aktivitetstillæg til kontanthjælp 10)"]
["Enlige forsørgere under 30 år",null,null,"§ 40, stk. 1",null,null,null,"Kr. pr. hændelse",null,90]
["Forsørgere under 30 år, som ikke har erhvervet ret til ekstra børnetilskud",null,null,"§ 40, stk. 1",null,null,null,"Kr. pr. hændelse",null,678]
["25-29 år, udeboende",null,null,"§ 40, stk. 1",null,null,null,"Kr. pr. hændelse",null,549]
["25-29 år, hjemmeboende",null,null,"§ 40, stk. 1",null,null,null,"Kr. pr. hændelse",null,1062]
[]
["Uddannelseshjælp"]
["Enlige forsørgere under 30 år",null,null,"§ 23, stk. 2, nr. 1",null,null,null,"Kr. pr. måned",null,12211]
["Forsørgere under 30 år, som ikke har erhvervet ret til ekstra børnetilskud",null,null,"§ 23, stk. 2, nr. 2",null,null,null,"Kr. pr. måned",null,8546]
["Under 30 år, gravid (passeret 12. svangerskabsuge)",null,null,"§ 23, stk. 2, nr. 3",null,null,null,"Kr. pr. måned",null,11143]
["Under 30 år, psykisk syg, forsørgelsespligt",null,null,"§ 23, stk. 2, nr. 4",null,null,null,"Kr. pr. måned",null,14808]
["Under 30 år, psykisk syg, udeboende",null,null,"§ 23, stk. 2, nr. 5",null,null,null,"Kr. pr. måned",null,11143]
["25-29 år, udeboende",null,null,"§ 23, stk. 2, nr. 6",null,null,null,"Kr. pr. måned",null,6106]
["25-29 år, hjemmeboende",null,null,"§ 23, stk. 2, nr. 7",null,null,null,"Kr. pr. måned",null,2631]
["Under 25 år, udeboende",null,null,"§ 23, stk. 2, nr. 8",null,null,null,"Kr. pr. måned",null,6106]
["Under 25 år, hjemmeboende",null,null,"§ 23, stk. 2, nr. 9",null,null,null,"Kr. pr. måned",null,2631]
["Under 30 år, bidragspligt, maksimum hjælp inkl. tillæg",null,null,"§ 23, stk. 3",null,null,null,"Kr. pr. måned",null,14808]
["Aktivitetstillæg/Barselstillæg til uddannelseshjælp"]
["Enlige forsørgere under 30 år",null,null,"§ 24, stk. 3, nr. 1",null,null,null,"Kr. pr. måned",null,2597]
["Forsørgere under 30 år, som ikke har erhvervet ret til ekstra børnetilskud.",null,null,"§ 24, stk. 3, nr. 2",null,null,null,"Kr. pr. måned",null,6263]
["25-29 år, udeboende",null,null,"§ 24, stk. 3, nr. 3",null,null,null,"Kr. pr. måned",null,5037]
["25-29 år, hjemmeboende",null,null,"§ 24, stk. 3, nr. 4",null,null,null,"Kr. pr. måned",null,8512]
["Under 25 år, udeboende",null,null,"§ 24, stk. 3, nr. 5",null,null,null,"Kr. pr. måned",null,1076]
["Under 25 år, hjemmeboende",null,null,"§ 24, stk. 3, nr. 6",null,null,null,"Kr. pr. måned",null,834]
["Periodesanktioner – fradrag i uddannelseshjælp 10)"]
["Enlige forsørgere under 30 år",null,null,"§ 35, stk. 3",null,null,null,"Kr. pr. dag",null,564]
["Forsørgere under 30 år, som ikke har erhvervet ret til ekstra børnetilskud",null,null,"§ 35, stk. 3",null,null,null,"Kr. pr. dag",null,394]
["Under 30 år, gravid (passeret 12. svangerskabsuge)",null,null,"§ 35, stk. 3",null,null,null,"Kr. pr. dag",null,514]
["Under 30 år, psykisk syg, forsørgelsespligt",null,null,"§ 35, stk. 3",null,null,null,"Kr. pr. dag",null,683]
["Under 30 år, psykisk syg, udeboende",null,null,"§ 35, stk. 3",null,null,null,"Kr. pr. dag",null,514]
["25-29 år, udeboende",null,null,"§ 35, stk. 3",null,null,null,"Kr. pr. dag",null,282]
["25-29 år, hjemmeboende",null,null,"§ 35, stk. 3",null,null,null,"Kr. pr. dag",null,121]
["Under 25 år, udeboende",null,null,"§ 35, stk. 3",null,null,null,"Kr. pr. dag",null,282]
["Under 25 år, hjemmeboende",null,null,"§ 35, stk. 3",null,null,null,"Kr. pr. dag",null,121]
["Under 30 år, bidragspligt, maksimum hjælp inkl. tillæg",null,null,"§ 35, stk. 3",null,null,null,"Kr. pr. dag",null,683]
["Periodesanktioner – fradrag i aktivitetstillæg til uddannelseshjælp 10)"]
["Enlige forsørgere under 30 år",null,null,"§ 35, stk. 3",null,null,null,"Kr. pr. dag",null,120]
["Forsørgere under 30 år, som ikke har erhvervet ret til ekstra børnetilskud",null,null,"§ 35, stk. 3",null,null,null,"Kr. pr. dag",null,289]
["25-29 år, udeboende",null,null,"§ 35, stk. 3",null,null,null,"Kr. pr. dag",null,232]
["25-29 år, hjemmeboende",null,null,"§ 35, stk. 3",null,null,null,"Kr. pr. dag",null,393]
["Under 25 år, udeboende",null,null,"§ 35, stk. 3",null,null,null,"Kr. pr. dag",null,50]
["Under 25 år, hjemmeboende",null,null,"§ 35, stk. 3",null,null,null,"Kr. pr. dag",null,38]
["Punktsanktioner – nedsættelse af uddannelseshjælp 10)"]
["Enlige forsørgere under 30 år",null,null,"§ 40, stk. 1",null,null,null,"Kr. pr. hændelse",null,1692]
["Forsørgere under 30 år, som ikke har erhvervet ret til ekstra børnetilskud",null,null,"§ 40, stk. 1",null,null,null,"Kr. pr. hændelse",null,1182]
["Under 30 år, gravid (passeret 12. svangerskabsuge)",null,null,"§ 40, stk. 1",null,null,null,"Kr. pr. hændelse",null,1542]
["Under 30 år, psykisk syg, forsørgelsespligt",null,null,"§ 40, stk. 1",null,null,null,"Kr. pr. hændelse",null,2049]
["Under 30 år, psykisk syg, udeboende",null,null,"§ 40, stk. 1",null,null,null,"Kr. pr. hændelse",null,1542]
["25-29 år, udeboende",null,null,"§ 40, stk. 1",null,null,null,"Kr. pr. hændelse",null,846]
["25-29 år, hjemmeboende",null,null,"§ 40, stk. 1",null,null,null,"Kr. pr. hændelse",null,363]
["Under 25 år, udeboende",null,null,"§ 40, stk. 1",null,null,null,"Kr. pr. hændelse",null,846]
["Under 25 år, hjemmeboende",null,null,"§ 40, stk. 1",null,null,null,"Kr. pr. hændelse",null,363]
["Under 30 år, bidragspligt, maksimum hjælp inkl. tillæg",null,null,"§ 40, stk. 1",null,null,null,"Kr. pr. hændelse",null,2049]
["Punktsanktioner – nedsættelse af aktivitetstillæg til uddannelseshjælp 10)"]
["Enlige forsørgere under 30 år",null,null,"§ 40, stk. 1",null,null,null,"Kr. pr. hændelse",null,360]
["Forsørgere under 30 år, som ikke har erhvervet ret til ekstra børnetilskud",null,null,"§ 40, stk. 1",null,null,null,"Kr. pr. hændelse",null,867]
["25-29 år, udeboende",null,null,"§ 40, stk. 1",null,null,null,"Kr. pr. hændelse",null,696]
["25-29 år, hjemmeboende",null,null,"§ 40, stk. 1",null,null,null,"Kr. pr. hændelse",null,1179]
["Under 25 år, udeboende",null,null,"§ 40, stk. 1",null,null,null,"Kr. pr. hændelse",null,150]
["Under 25 år, hjemmeboende",null,null,"§ 40, stk. 1",null,null,null,"Kr. pr. hændelse",null,114]
["Kontanthjælpsloft for modtagere af hjælp efter §§ 23-25 med et beløb svarende til satserne i § 25, stk. 2"]
["Gifte/samlevende, forsørgere",null,null,"§ 25 b, stk. 1, nr. 1",null,null,null,"Kr. pr. måned",null,14808]
["Gifte/samlevende, ikke forsørgere",null,null,"§ 25 b, stk. 1, nr. 2",null,null,null,"Kr. pr. måned",null,11143]
["Enlige, forsørger, 1 barn",null,null,"§ 25 b, stk. 1, nr. 3",null,null,null,"Kr. pr. måned",null,15439]
["Enlige, forsørger, 2 eller flere børn",null,null,"§ 25 b, stk. 1, nr. 4",null,null,null,"Kr. pr. måned",null,15803]
["Enlige, ikke forsørger",null,null,"§ 25 b, stk. 1, nr. 5",null,null,null,"Kr. pr. måned",null,13477]
["Kontanthjælpsloft for modtagere af hjælp efter § 25, stk. 3, og som ikke er omfattet af § 25 b, stk. 1"]
["Gifte/samlevende, forsørgere, 1 barn",null,null,"§ 25 b, stk. 2, nr. 1",null,null,null,"Kr. pr. måned",null,12643]
["Gifte/samlevende, forsørgere, 2 eller flere børn",null,null,"§ 25 b, stk. 2, nr. 2",null,null,null,"Kr. pr. måned",null,12518]
["Gifte/samlevende, ikke forsørgere",null,null,"§ 25 b, stk. 2, nr. 3",null,null,null,"Kr. pr. måned",null,9603]
["Enlige, forsørger, 1 barn",null,null,"§ 25 b, stk. 2, nr. 4",null,null,null,"Kr. pr. måned",null,15134]
["Enlige, forsørger, 2 eller flere børn",null,null,"§ 25 b, stk. 2, nr. 5",null,null,null,"Kr. pr. måned",null,15498]
["Enlige, ikke forsørger",null,null,"§ 25 b, stk. 2, nr. 6",null,null,null,"Kr. pr. måned",null,10316]
["Kontanthjælpsloft for modtagere af hjælp efter §§ 22-24, eller som får beregnet hjælp efter § 26, stk.2, og som ikke er omfattet af § 25b, stk.1"]
["Gifte/samlevende, forsørgere, 1 barn",null,null,"§ 25 b, stk. 3, nr. 1",null,null,null,"Kr. pr. måned",null,12057]
["Gifte/samlevende, forsørgere, 2 eller flere børn",null,null,"§ 25 b, stk. 3, nr. 2",null,null,null,"Kr. pr. måned",null,11894]
["Gifte/samlevende, ikke forsørgere",null,null,"§ 25 b, stk. 3, nr. 3",null,null,null,"Kr. pr. måned",null,9202]
["Enlige, forsørger, 1 barn",null,null,"§ 25 b, stk. 3, nr. 4",null,null,null,"Kr. pr. måned",null,14399]
["Enlige, forsørger, 2 eller flere børn",null,null,"§ 25 b, stk. 3, nr. 5",null,null,null,"Kr. pr. måned",null,14762]
["Enlige, ikke forsørger",null,null,"§ 25 b, stk. 3, nr. 6",null,null,null,"Kr. pr. måned",null,9910]
["Kontanthjælpsloft for ægtefæller, hvor en eller begge modtager integrationsydelse, og som ikke opfylder 225 timers kravet (Ægtefæller omfattet af § 13f, stk. 3 og 4)"]
["Ej nedsat hjælp, forsørger, 1 barn",null,null,"§ 25 b, stk. 4, nr. 1",null,null,null,"Kr. pr. måned",null,9232]
["Ej nedsat hjælp, forsørger, 2 eller flere børn",null,null,"§ 25 b, stk. 4, nr. 2",null,null,null,"Kr. pr. måned",null,9300]
["Ej nedsat hjælp, ikke forsørger",null,null,"§ 25 b, stk. 4, nr. 3",null,null,null,"Kr. pr. måned",null,6216]
["Nedsat hjælp, forsørger, 1 barn",null,null,"§ 25 b, stk. 4, nr. 4",null,null,null,"Kr. pr. måned",null,6975]
["Nedsat hjælp, forsørger, 2 eller flere børn",null,null,"§ 25 b, stk. 4, nr. 5",null,null,null,"Kr. pr. måned",null,7043]
["Nedsat hjælp, ikke forsørger",null,null,"§ 25 b, stk. 4, nr. 6",null,null,null,"Kr. pr. måned",null,5158]
["Nedsættelse af hjælpen til ugifte personer, der ikke opfylder kravet om 225 timers ordinært og ustøttet arbejde inden for de seneste 12 kalendermåneder"]
["Hjælp beregnet på baggrund af 14.808 kr./11.143 kr. pr. måned",null,null,"§ 13 g, stk. 1, nr. 1",null,null,null,"Kr. pr. måned",null,1016]
["Hjælp beregnet på baggrund af mindre end14. 808 kr./11.143 kr. pr. måned",null,null,"§ 13 g, stk. 1, nr. 2",null,null,null,"Kr. pr. måned",null,508]
["Omregningssats for ukendt arbejdstid til 225 timers-regel"]
["Omregningssats",null,null,"§ 13 f, stk. 15",null,null,null,"Kr. pr. time",null,120.99]
["Ægtefælleberegning – 225 timers-regel"]
["Forsørgere",null,null,"§ 26, stk. 5-8",null,null,null,"Kr. pr. måned",null,14808]
["Ikke-forsørgere",null,null,"§ 26, stk. 5-8",null,null,null,"Kr. pr. måned",null,11143]
["Engangshjælp"]
["Over 25 år, samt udeboende under 25 år (maksimum)",null,null,"§ 25 a, stk. 2",null,null,null,"Kr. pr. måned",null,5956]
["Hjemmeboende under 25 år (maksimum)",null,null,"§ 25 a, stk. 3",null,null,null,"Kr. pr. måned",null,2961]
["Hjælp til visse persongrupper"]
["Nået efterlønsalderen, ikke optjent pensionsret",null,null,"§ 27, stk. 1",null,null,null,"Kr. pr. måned",null,9383]
["Børnestøttebeløb, ikke optjent pensionsret",null,null,"§ 27, stk. 2",null,null,null,"Kr. pr. måned",null,2995]
["Enlige forsørgere – under 30 år (maksimum)",null,null,"§ 12, stk. 3",null,null,null,"Kr. pr. måned",null,12211]
["Fradrag ved formue og indtægt, beløb der ses bort fra"]
["Formue, enlige",null,null,"§ 14, stk. 1",null,null,null,"Kr. pr. måned",null,10000]
["Formue, ægtefæller",null,null,"§ 14, stk. 1",null,null,null,"Kr. pr. måned",null,20000]
["Formue, engangsbeløb fra forsikring ved kritisk sygdom",null,null,"§ 14, stk. 8",null,null,null,"Kr. pr. forsikringsbegivenhed",null,150000]
["Forsørgelsesydelse, ægtefæller, forsørgelsespligt",null,null,"§ 30, stk. 2",null,null,null,"Kr. pr. måned",null,14808]
["Forsørgelsesydelse, ægtefæller, andre",null,null,"§ 30, stk. 2",null,null,null,"Kr. pr. måned",null,11143]
["Fradrag pr. arbejdstime ved arbejdsindtægt",null,null,"§ 31, stk. 1",null,null,null,"Kr. pr. time",null,26.25]
["Fradrag for indtægter ved arbejde - STU (maksimumbeløb)",null,null,"§ 31, stk. 2",null,null,null,"Kr. pr. år",null,24823]
["Arbejdstillæg, ukendt arbejdstimer, omregningssats",null,null,"§ 31, stk. 3",null,null,null,"Kr. pr. time",null,230.08]
["Særlig støtte, grænsebeløb, boligudgift 11)"]
["Ikke-forsørgere",null,null,"§ 34, stk. 8",null,null,null,"Kr. pr. måned",null,2950]
["Forsørgere med et hjemmeboende barn",null,null,"§ 34, stk. 8",null,null,null,"Kr. pr. måned",null,4200]
["Forsørgere med et udeboende barn",null,null,"§ 34, stk. 8",null,null,null,"Kr. pr. måned",null,4300]
["Fradrag i grænsebeløbet pr. barn hjemme udover 1",null,null,"§ 34, stk. 8",null,null,null,"Kr. pr. måned",null,800]
["Fradrag i grænsebeløbet pr. barn ude udover 1",null,null,"§ 34, stk. 8",null,null,null,"Kr. pr. måned",null,650]
["Indtægtsgrænse efter 3 måneder - dagpengemaksimum",null,null,"§ 34, stk. 8",null,null,null,"Kr. pr. måned",null,18403]
["Grænse uafhængig af tidligere indtægter - integrationsydelse",null,null,"§ 34, stk. 8",null,null,null,"Kr. pr. måned",null,12973]
["Fradrag for forskudsvis udlagt børnebidrag"]
["Samlede udbetalt beløb (minimumsbeløb)",null,null,"§ 96 a, stk. 1",null,null,null,"Kr. pr. måned",null,14808]
["10) Bestemmelserne under ”Sanktioner” henviser til sanktionsbestemmelserne i §§ 35-41 i LBK nr. 468 af 20. maj 2016 af lov om aktiv socialpolitik med senere ændringer og vejledning nr. 10013 af 13. oktober 2016 om rådighed og sanktioner for personer, der ansøger om eller modtager integrationsydelse, uddannelseshjælp eller kontanthjælp."]
["11) Jf. BEK nr. 829 af 27. juni 2016 om særlig støtte efter § 34 i lov om aktiv socialpolitik."]